{"text_format":"1","workbook":"xlsx","n_sheets":6,"sheets":["all port","all port (EN)","SHZ","保存","作業","祝日"],"not_rendered":{"charts":0,"images":4,"macros":1,"external_links":0,"defined_names":2,"comments":0,"pivot_tables":0},"unopened":[],"bounds":{"document_bytes":16777216,"sheet_cells":100000,"rows_first":2000,"rows_last":500,"rows_between":2000,"halvings":0,"cell_chars":16384,"cell_head_chars":4096},"cells_cut":0,"cells_raw":0,"read":"whole","date_system":"1900"}

{"sheet":"all port","index":0,"n_rows":47,"n_cols":33,"rows_kept":47,"cut":false,"hidden":false,"merged":[[15,1,15,5],[16,1,16,5],[15,6,15,7],[16,6,16,7],[15,8,15,9],[16,8,16,9],[15,10,15,11],[16,10,16,11],[15,12,15,13],[16,12,16,13],[21,1,21,5],[22,1,22,5],[25,1,25,5],[17,1,17,5],[17,6,17,7],[17,8,17,9],[17,10,17,11],[26,1,26,5],[27,1,27,5],[26,6,26,7],[27,6,27,7],[26,8,26,9],[27,8,27,9],[26,10,26,11],[27,10,27,11],[23,1,23,5],[23,6,23,7],[23,8,23,9],[23,10,23,11],[24,1,24,5],[22,8,22,9],[22,10,22,11],[24,10,24,11],[10,8,10,9],[10,10,10,11],[14,12,14,13],[14,14,14,15],[32,8,32,9],[32,10,32,11],[32,12,32,13],[32,14,32,15],[21,6,21,7],[21,8,21,9],[21,10,21,11],[26,12,26,13],[27,12,27,13],[15,14,15,15],[16,14,16,15],[23,12,23,13],[24,6,24,7],[24,8,24,9],[25,6,25,7],[25,8,25,9],[25,10,25,11],[22,6,22,7],[3,27,3,32],[9,1,9,5],[9,6,9,7],[9,8,9,9],[9,10,9,11],[6,12,7,13],[6,6,7,7],[7,10,7,11],[7,8,7,9],[9,12,9,13],[3,0,3,25],[4,0,4,25],[6,1,7,5],[8,1,8,5],[6,8,6,9],[6,10,6,11],[4,30,4,32],[4,27,4,29],[6,14,6,15],[7,14,7,15],[9,14,9,15],[8,6,8,7],[8,8,8,9],[8,10,8,11],[10,1,10,5],[11,1,11,5],[12,1,12,5],[19,1,20,5],[19,6,20,7],[19,8,19,9],[19,10,19,11],[14,1,14,5],[14,6,14,7],[14,8,14,9],[14,10,14,11],[20,8,20,9],[20,10,20,11],[13,1,13,5],[13,6,13,7],[13,8,13,9],[13,10,13,11],[12,6,12,7],[12,8,12,9],[12,10,12,11],[11,6,11,7],[11,8,11,9],[11,10,11,11],[10,6,10,7],[8,12,8,13],[8,14,8,15],[29,12,30,13],[12,12,12,13],[11,12,11,13],[10,12,10,13],[11,14,11,15],[10,14,10,15],[12,14,12,15],[21,12,21,13],[19,12,20,13],[22,12,22,13],[17,12,17,13],[17,14,17,15],[13,12,13,13],[13,14,13,15],[24,12,24,13],[33,6,33,7],[33,8,33,9],[32,1,32,5],[32,6,32,7],[39,1,39,5],[30,10,30,11],[29,6,30,7],[31,8,31,9],[29,1,30,5],[30,8,30,9],[31,1,31,5],[31,6,31,7],[29,8,29,9],[29,10,29,11],[39,6,39,7],[39,8,39,9],[39,10,39,11],[38,1,38,5],[33,1,33,5],[36,1,36,5],[36,6,36,7],[36,8,36,9],[36,10,36,11],[37,1,37,5],[38,6,38,7],[40,12,40,13],[38,12,38,13],[38,8,38,9],[38,10,38,11],[34,1,34,5],[34,6,34,7],[34,8,34,9],[34,10,34,11],[34,12,34,13],[35,1,35,5],[35,6,35,7],[35,8,35,9],[35,10,35,11],[35,12,35,13],[40,1,40,5],[40,6,40,7],[40,8,40,9],[40,10,40,11],[36,12,36,13],[37,6,37,7],[37,8,37,9],[37,10,37,11],[37,12,37,13],[39,14,39,15],[29,14,29,15],[30,14,30,15],[25,12,25,13],[33,14,33,15],[31,14,31,15],[40,14,40,15],[38,14,38,15],[31,10,31,11],[31,12,31,13],[33,10,33,11],[34,14,34,15],[35,14,35,15],[39,12,39,13],[33,12,33,13],[36,14,36,15],[37,14,37,15]]}
[]
[]
[]
["SHENZHEN",null,null,null,null,null,null,null,null,null,null,null,null,null,null,null,null,null,null,null,null,null,null,null,null,null,null,"IMPORT SAILING SCHEDULE"]
[{"$f":"保存!F1","v":"【 FEBRUARY 】"},null,null,null,null,null,null,null,null,null,null,null,null,null,null,null,null,null,null,null,null,null,null,null,null,null,null,"Date :",null,null,{"$f":"TODAY()","v":"2026-02-17"}]
[]
[null,"VESSEL",null,null,null,null,"VOY",null,"SHENZHEN",null,"SHEKOU",null,"TOKYO",null,"■",null,null,null,null,null,null,null,null,null,null,null,null,null,null,null,null,null,"※ SUBJECT TO ALTERATION WITH OR WITHOUT NOTICE"]
[null,null,null,null,null,null,null,null,"● CUT",null,"SAILING",null,null,null,"YOKOHAMA",null,null,null,null,null,null,null,null,null,null,null,null,null,null,null,null,null,"※ CO-LOADの場合は搬入先が変更になります。"]
[null,{"$f":"IF(SHZ!A3=0,\"TBA\",SHZ!A3)","v":"TS MAWEI"},null,null,null,null,{"$f":"IF(SHZ!B3=0,\"---\",SHZ!B3)","v":"26002N"},null,{"$f":"IF(SHZ!E3=0,\"---\",SHZ!E3)","v":"2026-02-09"},null,{"$f":"IF(SHZ!G3=0,\"---\",SHZ!G3)","v":"2026-02-16"},null,{"$f":"IF(SHZ!I3=0,\"---\",SHZ!I3)","v":"2026-02-21"},null,{"$f":"IF(ISERROR(WORKDAY(M9,2,祝日!$B$3:$B$34)),\"---\",WORKDAY(M9,2,祝日!$B$3:$B$34))","v":"2026-02-24"},null,null,null,null,null,null,null,null,null,null,"<東京> "]
[null,{"$f":"IF(SHZ!A4=0,\"TBA\",SHZ!A4)","v":"TS SURABAYA"},null,null,null,null,{"$f":"IF(SHZ!B4=0,\"---\",SHZ!B4)","v":"26003N"},null,{"$f":"IF(SHZ!E4=0,\"---\",SHZ!E4)","v":"2026-02-24"},null,{"$f":"IF(SHZ!G4=0,\"---\",SHZ!G4)","v":"2026-03-01"},null,{"$f":"IF(SHZ!I4=0,\"---\",SHZ!I4)","v":"2026-03-05"},null,{"$f":"IF(ISERROR(WORKDAY(M10,2,祝日!$B$3:$B$34)),\"---\",WORKDAY(M10,2,祝日!$B$3:$B$34))","v":"2026-03-09"},null,null,null,null,null,null,null,null,null,null,"山九㈱ 大井物流センター 保税蔵置場"]
[null,{"$f":"IF(SHZ!A5=0,\"TBA\",SHZ!A5)","v":"TS CHIBA"},null,null,null,null,{"$f":"IF(SHZ!B5=0,\"---\",SHZ!B5)","v":"26003N"},null,{"$f":"IF(SHZ!E5=0,\"---\",SHZ!E5)","v":"2026-02-26"},null,{"$f":"IF(SHZ!G5=0,\"---\",SHZ!G5)","v":"2026-03-05"},null,{"$f":"IF(SHZ!I5=0,\"---\",SHZ!I5)","v":"2026-03-09"},null,{"$f":"IF(ISERROR(WORKDAY(M11,2,祝日!$B$3:$B$34)),\"---\",WORKDAY(M11,2,祝日!$B$3:$B$34))","v":"2026-03-11"},null,null,null,null,null,null,null,null,null,null,"東京都大田区東海4丁目7-4　NACCS : 1FWR1"]
[null,{"$f":"IF(SHZ!A6=0,\"TBA\",SHZ!A6)","v":"TBA"},null,null,null,null,{"$f":"IF(SHZ!B6=0,\"---\",SHZ!B6)","v":"TBA"},null,{"$f":"IF(SHZ!E6=0,\"---\",SHZ!E6)","v":"2026-03-03"},null,{"$f":"IF(SHZ!G6=0,\"---\",SHZ!G6)","v":"2026-03-08"},null,{"$f":"IF(SHZ!I6=0,\"---\",SHZ!I6)","v":"2026-03-12"},null,{"$f":"IF(ISERROR(WORKDAY(M12,2,祝日!$B$3:$B$34)),\"---\",WORKDAY(M12,2,祝日!$B$3:$B$34))","v":"2026-03-16"},null,null,null,null,null,null,null,null,null,null,"TEL : 03-5755-0039   FAX : 03-3790-3901"]
[null,{"$f":"IF(SHZ!A7=0,\"TBA\",SHZ!A7)","v":"TS LIANYUNGANG"},null,null,null,null,{"$f":"IF(SHZ!B7=0,\"---\",SHZ!B7)","v":"26006N"},null,{"$f":"IF(SHZ!E7=0,\"---\",SHZ!E7)","v":"2026-03-05"},null,{"$f":"IF(SHZ!G7=0,\"---\",SHZ!G7)","v":"2026-03-12"},null,{"$f":"IF(SHZ!I7=0,\"---\",SHZ!I7)","v":"2026-03-16"},null,{"$f":"IF(ISERROR(WORKDAY(M13,2,祝日!$B$3:$B$34)),\"---\",WORKDAY(M13,2,祝日!$B$3:$B$34))","v":"2026-03-18"},null,null,null,null,null,null,null,null,null,null,"<横浜> "]
[null,{"$f":"IF(SHZ!A8=0,\"TBA\",SHZ!A8)","v":"TS JOHOR"},null,null,null,null,{"$f":"IF(SHZ!B8=0,\"---\",SHZ!B8)","v":"26003N"},null,{"$f":"IF(SHZ!E8=0,\"---\",SHZ!E8)","v":"2026-03-10"},null,{"$f":"IF(SHZ!G8=0,\"---\",SHZ!G8)","v":"2026-03-15"},null,{"$f":"IF(SHZ!I8=0,\"---\",SHZ!I8)","v":"2026-03-19"},null,{"$f":"IF(ISERROR(WORKDAY(M14,2,祝日!$B$3:$B$34)),\"---\",WORKDAY(M14,2,祝日!$B$3:$B$34))","v":"2026-03-23"},null,null,null,null,null,null,null,null,null,null,"ジャパン・バン・ラインズ㈱ 本牧埠頭A-3DBA "]
[null,{"$f":"IF(SHZ!A9=0,\"TBA\",SHZ!A9)","v":"TS CHIBA"},null,null,null,null,{"$f":"IF(SHZ!B9=0,\"---\",SHZ!B9)","v":"26004N"},null,{"$f":"IF(SHZ!E9=0,\"---\",SHZ!E9)","v":"2026-03-12"},null,{"$f":"IF(SHZ!G9=0,\"---\",SHZ!G9)","v":"2026-03-19"},null,{"$f":"IF(SHZ!I9=0,\"---\",SHZ!I9)","v":"2026-03-23"},null,{"$f":"IF(ISERROR(WORKDAY(M15,2,祝日!$B$3:$B$34)),\"---\",WORKDAY(M15,2,祝日!$B$3:$B$34))","v":"2026-03-25"},null,null,null,null,null,null,null,null,null,null,"横浜市中区本牧埠頭 6番地　NACCS : 2EDZ3 "]
[null,{"$f":"IF(SHZ!A10=0,\"TBA\",SHZ!A10)","v":"TS SURABAYA"},null,null,null,null,{"$f":"IF(SHZ!B10=0,\"---\",SHZ!B10)","v":"26004N"},null,{"$f":"IF(SHZ!E10=0,\"---\",SHZ!E10)","v":"2026-03-17"},null,{"$f":"IF(SHZ!G10=0,\"---\",SHZ!G10)","v":"2026-03-22"},null,{"$f":"IF(SHZ!I10=0,\"---\",SHZ!I10)","v":"2026-03-26"},null,{"$f":"IF(ISERROR(WORKDAY(M16,2,祝日!$B$3:$B$34)),\"---\",WORKDAY(M16,2,祝日!$B$3:$B$34))","v":"2026-03-30"},null,null,null,null,null,null,null,null,null,null,"TEL : 045-625-3414   FAX : 045-625-3433 "]
[null,{"$f":"IF(SHZ!A11=0,\"TBA\",SHZ!A11)","v":"TS LIANYUNGANG"},null,null,null,null,{"$f":"IF(SHZ!B11=0,\"---\",SHZ!B11)","v":"26007N"},null,{"$f":"IF(SHZ!E11=0,\"---\",SHZ!E11)","v":"2026-03-19"},null,{"$f":"IF(SHZ!G11=0,\"---\",SHZ!G11)","v":"2026-03-26"},null,{"$f":"IF(SHZ!I11=0,\"---\",SHZ!I11)","v":"2026-03-30"},null,{"$f":"IF(ISERROR(WORKDAY(M17,2,祝日!$B$3:$B$34)),\"---\",WORKDAY(M17,2,祝日!$B$3:$B$34))","v":"2026-04-01"},null,null,null,null,null,null,null,null,null,null,"<名古屋> "]
[null,{"$f":"IF(SHZ!A12=0,\"TBA\",SHZ!A12)","v":"TS MAWEI"},null,null,null,null,{"$f":"IF(SHZ!B12=0,\"---\",SHZ!B12)","v":"26005N"},null,{"$f":"IF(SHZ!E12=0,\"---\",SHZ!E12)","v":"2026-03-24"},null,{"$f":"IF(SHZ!G12=0,\"---\",SHZ!G12)","v":"2026-03-29"},null,{"$f":"IF(SHZ!I12=0,\"---\",SHZ!I12)","v":"2026-04-02"},null,{"$f":"IF(ISERROR(WORKDAY(M18,2,祝日!$B$3:$B$34)),\"---\",WORKDAY(M18,2,祝日!$B$3:$B$34))","v":"2026-04-06"},null,null,null,null,null,null,null,null,null,null,"伊勢湾海運㈱ 伊勢湾海運西名港 H/W "]
[null,"● CFS CUT ： 17:00　■ 横浜 ： 東京揚げ・デバン後、横浜CFSへ回送となります。",null,null,null,null,null,null,null,null,null,null,null,null,null,null,null,null,null,null,null,null,null,null,null,"愛知県海部郡飛島村東浜 1-6-1　NACCS : 5EWD2"]
[null,"VESSEL",null,null,null,null,"VOY",null,"SHENZHEN",null,"SHEKOU",null,"NAGOYA",null,null,null,null,null,null,null,null,null,null,null,null,"TEL : 0567-55-2711   FAX : 0567-55-2714"]
[null,null,null,null,null,null,null,null,"● CUT",null,"SAILING",null,null,null,null,null,null,null,null,null,null,null,null,null,null,"<大阪> "]
[null,{"$f":"IF(SHZ!A29=0,\"TBA\",SHZ!A29)","v":"TS CHIBA"},null,null,null,null,{"$f":"IF(SHZ!B29=0,\"---\",SHZ!B29)","v":"26002N"},null,{"$f":"IF(SHZ!E29=0,\"---\",SHZ!E29)","v":"2026-02-05"},null,{"$f":"IF(SHZ!G29=0,\"---\",SHZ!G29)","v":"2026-02-11"},null,{"$f":"IF(SHZ!I29=0,\"---\",SHZ!I29)","v":"2026-02-17"},null,null,null,null,null,null,null,null,null,null,null,null,"㈱辰巳商会 南港NO.1 H.W "]
[null,{"$f":"IF(SHZ!A30=0,\"TBA\",SHZ!A30)","v":"TS MAWEI"},null,null,null,null,{"$f":"IF(SHZ!B30=0,\"---\",SHZ!B30)","v":"26002N"},null,{"$f":"IF(SHZ!E30=0,\"---\",SHZ!E30)","v":"2026-02-09"},null,{"$f":"IF(SHZ!G30=0,\"---\",SHZ!G30)","v":"2026-02-16"},null,{"$f":"IF(SHZ!I30=0,\"---\",SHZ!I30)","v":"2026-02-23"},null,null,null,null,null,null,null,null,null,null,null,null,"大阪市住之江区南港東 7-1-24　NACCS : 4IW62 "]
[null,{"$f":"IF(SHZ!A31=0,\"TBA\",SHZ!A31)","v":"TS CHIBA"},null,null,null,null,{"$f":"IF(SHZ!B31=0,\"---\",SHZ!B31)","v":"26003N"},null,{"$f":"IF(SHZ!E31=0,\"---\",SHZ!E31)","v":"2026-02-26"},null,{"$f":"IF(SHZ!G31=0,\"---\",SHZ!G31)","v":"2026-03-05"},null,{"$f":"IF(SHZ!I31=0,\"---\",SHZ!I31)","v":"2026-03-11"},null,null,null,null,null,null,null,null,null,null,null,null,"TEL : 06-6612-3153   FAX : 06-6612-3180 "]
[null,{"$f":"IF(SHZ!A32=0,\"TBA\",SHZ!A32)","v":"TS LIANYUNGANG "},null,null,null,null,{"$f":"IF(SHZ!B32=0,\"---\",SHZ!B32)","v":"26006N"},null,{"$f":"IF(SHZ!E32=0,\"---\",SHZ!E32)","v":"2026-03-05"},null,{"$f":"IF(SHZ!G32=0,\"---\",SHZ!G32)","v":"2026-03-12"},null,{"$f":"IF(SHZ!I32=0,\"---\",SHZ!I32)","v":"2026-03-18"},null,null,null,null,null,null,null,null,null,null,null,null,"<神戸> "]
[null,{"$f":"IF(SHZ!A33=0,\"TBA\",SHZ!A33)","v":"TS CHIBA"},null,null,null,null,{"$f":"IF(SHZ!B33=0,\"---\",SHZ!B33)","v":"26004N"},null,{"$f":"IF(SHZ!E33=0,\"---\",SHZ!E33)","v":"2026-03-12"},null,{"$f":"IF(SHZ!G33=0,\"---\",SHZ!G33)","v":"2026-03-19"},null,{"$f":"IF(SHZ!I33=0,\"---\",SHZ!I33)","v":"2026-03-25"},null,null,null,null,null,null,null,null,null,null,null,null,"㈱辰巳商会 PI物流センター "]
[null,{"$f":"IF(SHZ!A34=0,\"TBA\",SHZ!A34)","v":"TS LIANYUNGANG "},null,null,null,null,{"$f":"IF(SHZ!B34=0,\"---\",SHZ!B34)","v":"26007N"},null,{"$f":"IF(SHZ!E34=0,\"---\",SHZ!E34)","v":"2026-03-19"},null,{"$f":"IF(SHZ!G34=0,\"---\",SHZ!G34)","v":"2026-03-26"},null,{"$f":"IF(SHZ!I34=0,\"---\",SHZ!I34)","v":"2026-04-01"},null,null,null,null,null,null,null,null,null,null,null,null,"神戸市中央区港島 7-13　NACCS : 3FRA2 "]
[null,{"$f":"IF(SHZ!A35=0,\"TBA\",SHZ!A35)","v":"TS CHIBA"},null,null,null,null,{"$f":"IF(SHZ!B35=0,\"---\",SHZ!B35)","v":"26005N"},null,{"$f":"IF(SHZ!E35=0,\"---\",SHZ!E35)","v":"2026-03-26"},null,{"$f":"IF(SHZ!G35=0,\"---\",SHZ!G35)","v":"2026-04-02"},null,{"$f":"IF(SHZ!I35=0,\"---\",SHZ!I35)","v":"2026-04-07"},null,null,null,null,null,null,null,null,null,null,null,null,"TEL : 078-302-0282   FAX : 078-302-1844 "]
[null,"● CFS CUT ： 17:00"]
[null,"VESSEL",null,null,null,null,"VOY",null,"SHENZHEN",null,"SHEKOU",null,"OSAKA",null,"■",null,null,null,null,null,null,null,null,null,null,"【サービス内容, 営業に関するお問い合わせ】"]
[null,null,null,null,null,null,null,null,"● CUT",null,"SAILING",null,null,null,"KOBE",null,null,null,null,null,null,null,null,null,null,"東京本社",null,"TEL : 03-3276-5946"]
[null,{"$f":"IF(SHZ!A16=0,\"TBA\",SHZ!A16)","v":"TAICHUNG"},null,null,null,null,{"$f":"IF(SHZ!B16=0,\"---\",SHZ!B16)","v":"421N"},null,{"$f":"IF(SHZ!E16=0,\"---\",SHZ!E16)","v":"2026-02-05"},null,{"$f":"IF(SHZ!G16=0,\"---\",SHZ!G16)","v":"2026-02-13"},null,{"$f":"IF(SHZ!I16=0,\"---\",SHZ!I16)","v":"2026-02-17"},null,{"$f":"IF(ISERROR(WORKDAY(M32,2,祝日!$B$3:$B$24)),\"---\",WORKDAY(M32,2,祝日!$B$3:$B$24))","v":"2026-02-19"},null,null,null,null,null,null,null,null,null,null,"横浜支店",null,"TEL: 045-226-2051"]
[null,{"$f":"IF(SHZ!A17=0,\"TBA\",SHZ!A17)","v":"TBA"},null,null,null,null,{"$f":"IF(SHZ!B17=0,\"---\",SHZ!B17)","v":"TBA"},null,{"$f":"IF(SHZ!E17=0,\"---\",SHZ!E17)","v":"2026-02-09"},null,{"$f":"IF(SHZ!G17=0,\"---\",SHZ!G17)","v":"2026-02-14"},null,{"$f":"IF(SHZ!I17=0,\"---\",SHZ!I17)","v":"2026-02-18"},null,{"$f":"IF(ISERROR(WORKDAY(M33,2,祝日!$B$3:$B$24)),\"---\",WORKDAY(M33,2,祝日!$B$3:$B$24))","v":"2026-02-20"},null,null,null,null,null,null,null,null,null,null,"名古屋支店",null,"TEL : 052-232-7730        "]
[null,{"$f":"IF(SHZ!A18=0,\"TBA\",SHZ!A18)","v":"TS KOBE"},null,null,null,null,{"$f":"IF(SHZ!B18=0,\"---\",SHZ!B18)","v":"26004N"},null,{"$f":"IF(SHZ!E18=0,\"---\",SHZ!E18)","v":"2026-02-24"},null,{"$f":"IF(SHZ!G18=0,\"---\",SHZ!G18)","v":"2026-02-28"},null,{"$f":"IF(SHZ!I18=0,\"---\",SHZ!I18)","v":"2026-03-04"},null,{"$f":"IF(ISERROR(WORKDAY(M34,2,祝日!$B$3:$B$24)),\"---\",WORKDAY(M34,2,祝日!$B$3:$B$24))","v":"2026-03-06"},null,null,null,null,null,null,null,null,null,null,"大阪本社",null,"TEL : 06-6260-4716"]
[null,{"$f":"IF(SHZ!A19=0,\"TBA\",SHZ!A19)","v":"TAICHUNG"},null,null,null,null,{"$f":"IF(SHZ!B19=0,\"---\",SHZ!B19)","v":"422N"},null,{"$f":"IF(SHZ!E19=0,\"---\",SHZ!E19)","v":"2026-02-26"},null,{"$f":"IF(SHZ!G19=0,\"---\",SHZ!G19)","v":"2026-03-04"},null,{"$f":"IF(SHZ!I19=0,\"---\",SHZ!I19)","v":"2026-03-08"},null,{"$f":"IF(ISERROR(WORKDAY(M35,2,祝日!$B$3:$B$24)),\"---\",WORKDAY(M35,2,祝日!$B$3:$B$24))","v":"2026-03-10"},null,null,null,null,null,null,null,null,null,null,"神戸支店",null,"TEL : 078-222-1071"]
[null,{"$f":"IF(SHZ!A20=0,\"TBA\",SHZ!A20)","v":"TS HAKATA"},null,null,null,null,{"$f":"IF(SHZ!B20=0,\"---\",SHZ!B20)","v":"26004N"},null,{"$f":"IF(SHZ!E20=0,\"---\",SHZ!E20)","v":"2026-03-03"},null,{"$f":"IF(SHZ!G20=0,\"---\",SHZ!G20)","v":"2026-03-07"},null,{"$f":"IF(SHZ!I20=0,\"---\",SHZ!I20)","v":"2026-03-10"},null,{"$f":"IF(ISERROR(WORKDAY(M36,2,祝日!$B$3:$B$24)),\"---\",WORKDAY(M36,2,祝日!$B$3:$B$24))","v":"2026-03-12"},null,null,null,null,null,null,null,null,null,null,"福岡営業所",null,"TEL : 092-436-4480 "]
[null,{"$f":"IF(SHZ!A21=0,\"TBA\",SHZ!A21)","v":"INTERASIA RESILIENCE"},null,null,null,null,{"$f":"IF(SHZ!B21=0,\"---\",SHZ!B21)","v":"N076"},null,{"$f":"IF(SHZ!E21=0,\"---\",SHZ!E21)","v":"2026-03-05"},null,{"$f":"IF(SHZ!G21=0,\"---\",SHZ!G21)","v":"2026-03-11"},null,{"$f":"IF(SHZ!I21=0,\"---\",SHZ!I21)","v":"2026-03-15"},null,{"$f":"IF(ISERROR(WORKDAY(M37,2,祝日!$B$3:$B$24)),\"---\",WORKDAY(M37,2,祝日!$B$3:$B$24))","v":"2026-03-17"}]
[null,{"$f":"IF(SHZ!A22=0,\"TBA\",SHZ!A22)","v":"TBA"},null,null,null,null,{"$f":"IF(SHZ!B22=0,\"---\",SHZ!B22)","v":"TBA"},null,{"$f":"IF(SHZ!E22=0,\"---\",SHZ!E22)","v":"2026-03-10"},null,{"$f":"IF(SHZ!G22=0,\"---\",SHZ!G22)","v":"2026-03-14"},null,{"$f":"IF(SHZ!I22=0,\"---\",SHZ!I22)","v":"2026-03-17"},null,{"$f":"IF(ISERROR(WORKDAY(M38,2,祝日!$B$3:$B$24)),\"---\",WORKDAY(M38,2,祝日!$B$3:$B$24))","v":"2026-03-19"}]
[null,{"$f":"IF(SHZ!A23=0,\"TBA\",SHZ!A23)","v":"TBA"},null,null,null,null,{"$f":"IF(SHZ!B23=0,\"---\",SHZ!B23)","v":"TBA"},null,{"$f":"IF(SHZ!E23=0,\"---\",SHZ!E23)","v":"2026-03-12"},null,{"$f":"IF(SHZ!G23=0,\"---\",SHZ!G23)","v":"2026-03-18"},null,{"$f":"IF(SHZ!I23=0,\"---\",SHZ!I23)","v":"2026-03-22"},null,{"$f":"IF(ISERROR(WORKDAY(M39,2,祝日!$B$3:$B$24)),\"---\",WORKDAY(M39,2,祝日!$B$3:$B$24))","v":"2026-03-24"}]
[null,{"$f":"IF(SHZ!A24=0,\"TBA\",SHZ!A24)","v":"TBA"},null,null,null,null,{"$f":"IF(SHZ!B24=0,\"---\",SHZ!B24)","v":"TBA"},null,{"$f":"IF(SHZ!E24=0,\"---\",SHZ!E24)","v":"2026-03-17"},null,{"$f":"IF(SHZ!G24=0,\"---\",SHZ!G24)","v":"2026-03-21"},null,{"$f":"IF(SHZ!I24=0,\"---\",SHZ!I24)","v":"2026-03-24"},null,{"$f":"IF(ISERROR(WORKDAY(M40,2,祝日!$B$3:$B$24)),\"---\",WORKDAY(M40,2,祝日!$B$3:$B$24))","v":"2026-03-26"}]
[null,{"$f":"IF(SHZ!A25=0,\"TBA\",SHZ!A25)","v":"TBA"},null,null,null,null,{"$f":"IF(SHZ!B25=0,\"---\",SHZ!B25)","v":"TBA"},null,{"$f":"IF(SHZ!E25=0,\"---\",SHZ!E25)","v":"2026-03-19"},null,{"$f":"IF(SHZ!G25=0,\"---\",SHZ!G25)","v":"2026-03-25"},null,{"$f":"IF(SHZ!I25=0,\"---\",SHZ!I25)","v":"2026-03-29"},null,{"$f":"IF(ISERROR(WORKDAY(M41,2,祝日!$B$3:$B$24)),\"---\",WORKDAY(M41,2,祝日!$B$3:$B$24))","v":"2026-03-31"}]
[null,"● CFS CUT ： 17:00　■ 神戸 ： 大阪揚げ・デバン後、神戸CFSへ回送となります。"]
[]
[]
[null,"【サービス内容, 営業に関するお問い合わせ】"]
[null,"東京・横浜・名古屋（東日本）揚げ ：",null,null,null,null,null,null,null,"東京本社　TEL : 03-3276-5943　FAX : 03-6684-7799　E-MAIL : tky-an@ntl-naigai.co.jp"]
[null,"大阪・神戸・九州（西日本）揚げ ：",null,null,null,null,null,null,null,"大阪本社　TEL : 06-6260-4716　FAX : 06-6260-4718　E-MAIL : osk-an@ntl-naigai.co.jp"]

{"sheet":"all port (EN)","index":1,"n_rows":42,"n_cols":33,"rows_kept":42,"cut":false,"hidden":false,"merged":[[23,1,23,5],[23,6,23,7],[23,8,23,9],[23,10,23,11],[23,12,23,13],[24,1,24,5],[24,6,24,7],[24,8,24,9],[24,10,24,11],[24,12,24,13],[3,0,3,25],[3,27,3,32],[4,0,4,25],[4,27,4,29],[4,30,4,32],[6,1,7,5],[6,6,7,7],[6,8,6,9],[6,10,6,11],[6,12,7,13],[6,14,6,15],[7,8,7,9],[7,10,7,11],[7,14,7,15],[11,1,11,5],[11,6,11,7],[11,8,11,9],[11,10,11,11],[11,12,11,13],[11,14,11,15],[8,1,8,5],[8,6,8,7],[8,8,8,9],[8,10,8,11],[8,12,8,13],[8,14,8,15],[10,1,10,5],[10,6,10,7],[10,8,10,9],[10,10,10,11],[10,12,10,13],[10,14,10,15],[9,1,9,5],[9,6,9,7],[9,8,9,9],[9,10,9,11],[9,12,9,13],[9,14,9,15],[13,1,13,5],[13,6,13,7],[13,8,13,9],[13,10,13,11],[13,12,13,13],[13,14,13,15],[12,1,12,5],[12,6,12,7],[12,8,12,9],[12,10,12,11],[12,12,12,13],[12,14,12,15],[17,14,17,15],[16,1,16,5],[16,6,16,7],[16,8,16,9],[16,10,16,11],[16,12,16,13],[16,14,16,15],[14,1,14,5],[14,6,14,7],[14,8,14,9],[14,10,14,11],[14,12,14,13],[14,14,14,15],[15,1,15,5],[15,6,15,7],[15,8,15,9],[15,10,15,11],[15,12,15,13],[15,14,15,15],[19,1,20,5],[19,6,20,7],[19,8,19,9],[19,10,19,11],[19,12,20,13],[20,8,20,9],[20,10,20,11],[17,1,17,5],[17,6,17,7],[17,8,17,9],[17,10,17,11],[17,12,17,13],[21,1,21,5],[21,6,21,7],[21,8,21,9],[21,10,21,11],[21,12,21,13],[22,1,22,5],[22,6,22,7],[22,8,22,9],[22,10,22,11],[22,12,22,13],[25,1,25,5],[25,6,25,7],[25,8,25,9],[25,10,25,11],[25,12,25,13],[26,1,26,5],[26,6,26,7],[26,8,26,9],[26,10,26,11],[26,12,26,13],[27,1,27,5],[27,6,27,7],[27,8,27,9],[27,10,27,11],[27,12,27,13],[31,1,31,5],[31,6,31,7],[31,8,31,9],[31,10,31,11],[31,12,31,13],[32,1,32,5],[32,6,32,7],[32,8,32,9],[32,10,32,11],[32,12,32,13],[32,14,32,15],[31,14,31,15],[29,1,30,5],[29,6,30,7],[29,8,29,9],[29,10,29,11],[29,12,30,13],[29,14,29,15],[30,8,30,9],[30,10,30,11],[30,14,30,15],[34,1,34,5],[34,6,34,7],[34,8,34,9],[34,10,34,11],[34,12,34,13],[34,14,34,15],[33,1,33,5],[33,6,33,7],[33,8,33,9],[33,10,33,11],[33,12,33,13],[33,14,33,15],[38,1,38,5],[38,6,38,7],[38,8,38,9],[38,10,38,11],[38,12,38,13],[38,14,38,15],[35,1,35,5],[35,6,35,7],[35,8,35,9],[35,10,35,11],[35,12,35,13],[35,14,35,15],[36,1,36,5],[36,6,36,7],[36,8,36,9],[36,10,36,11],[36,12,36,13],[36,14,36,15],[37,1,37,5],[37,6,37,7],[37,8,37,9],[37,10,37,11],[37,12,37,13],[37,14,37,15],[40,1,40,5],[40,6,40,7],[40,8,40,9],[40,10,40,11],[40,12,40,13],[40,14,40,15],[39,1,39,5],[39,6,39,7],[39,8,39,9],[39,10,39,11],[39,12,39,13],[39,14,39,15]]}
[]
[]
[]
["SHENZHEN",null,null,null,null,null,null,null,null,null,null,null,null,null,null,null,null,null,null,null,null,null,null,null,null,null,null,"IMPORT SAILING SCHEDULE"]
[{"$f":"'all port'!A5:Z5","v":"【 FEBRUARY 】"},null,null,null,null,null,null,null,null,null,null,null,null,null,null,null,null,null,null,null,null,null,null,null,null,null,null,"Date :",null,null,{"$f":"'all port'!AE5:AG5","v":"2026-02-17"}]
[]
[null,"VESSEL",null,null,null,null,"VOY",null,"SHENZHEN",null,"SHEKOU",null,"TOKYO",null,"■",null,null,null,null,null,null,null,null,null,null,null,null,null,null,null,null,null,"※ SUBJECT TO ALTERATION WITH OR WITHOUT NOTICE"]
[null,null,null,null,null,null,null,null,"● CUT",null,"SAILING",null,null,null,"YOKOHAMA"]
[null,{"$f":"'all port'!B9","v":"TS MAWEI"},null,null,null,null,{"$f":"'all port'!G9","v":"26002N"},null,{"$f":"'all port'!I9","v":"2026-02-09"},null,{"$f":"'all port'!K9","v":"2026-02-16"},null,{"$f":"'all port'!M9","v":"2026-02-21"},null,{"$f":"'all port'!O9","v":"2026-02-24"}]
[null,{"$f":"'all port'!B10","v":"TS SURABAYA"},null,null,null,null,{"$f":"'all port'!G10","v":"26003N"},null,{"$f":"'all port'!I10","v":"2026-02-24"},null,{"$f":"'all port'!K10","v":"2026-03-01"},null,{"$f":"'all port'!M10","v":"2026-03-05"},null,{"$f":"'all port'!O10","v":"2026-03-09"}]
[null,{"$f":"'all port'!B11","v":"TS CHIBA"},null,null,null,null,{"$f":"'all port'!G11","v":"26003N"},null,{"$f":"'all port'!I11","v":"2026-02-26"},null,{"$f":"'all port'!K11","v":"2026-03-05"},null,{"$f":"'all port'!M11","v":"2026-03-09"},null,{"$f":"'all port'!O11","v":"2026-03-11"}]
[null,{"$f":"'all port'!B12","v":"TBA"},null,null,null,null,{"$f":"'all port'!G12","v":"TBA"},null,{"$f":"'all port'!I12","v":"2026-03-03"},null,{"$f":"'all port'!K12","v":"2026-03-08"},null,{"$f":"'all port'!M12","v":"2026-03-12"},null,{"$f":"'all port'!O12","v":"2026-03-16"}]
[null,{"$f":"'all port'!B13","v":"TS LIANYUNGANG"},null,null,null,null,{"$f":"'all port'!G13","v":"26006N"},null,{"$f":"'all port'!I13","v":"2026-03-05"},null,{"$f":"'all port'!K13","v":"2026-03-12"},null,{"$f":"'all port'!M13","v":"2026-03-16"},null,{"$f":"'all port'!O13","v":"2026-03-18"}]
[null,{"$f":"'all port'!B14","v":"TS JOHOR"},null,null,null,null,{"$f":"'all port'!G14","v":"26003N"},null,{"$f":"'all port'!I14","v":"2026-03-10"},null,{"$f":"'all port'!K14","v":"2026-03-15"},null,{"$f":"'all port'!M14","v":"2026-03-19"},null,{"$f":"'all port'!O14","v":"2026-03-23"}]
[null,{"$f":"'all port'!B15","v":"TS CHIBA"},null,null,null,null,{"$f":"'all port'!G15","v":"26004N"},null,{"$f":"'all port'!I15","v":"2026-03-12"},null,{"$f":"'all port'!K15","v":"2026-03-19"},null,{"$f":"'all port'!M15","v":"2026-03-23"},null,{"$f":"'all port'!O15","v":"2026-03-25"}]
[null,{"$f":"'all port'!B16","v":"TS SURABAYA"},null,null,null,null,{"$f":"'all port'!G16","v":"26004N"},null,{"$f":"'all port'!I16","v":"2026-03-17"},null,{"$f":"'all port'!K16","v":"2026-03-22"},null,{"$f":"'all port'!M16","v":"2026-03-26"},null,{"$f":"'all port'!O16","v":"2026-03-30"}]
[null,{"$f":"'all port'!B17","v":"TS LIANYUNGANG"},null,null,null,null,{"$f":"'all port'!G17","v":"26007N"},null,{"$f":"'all port'!I17","v":"2026-03-19"},null,{"$f":"'all port'!K17","v":"2026-03-26"},null,{"$f":"'all port'!M17","v":"2026-03-30"},null,{"$f":"'all port'!O17","v":"2026-04-01"}]
[null,{"$f":"'all port'!B18","v":"TS MAWEI"},null,null,null,null,{"$f":"'all port'!G18","v":"26005N"},null,{"$f":"'all port'!I18","v":"2026-03-24"},null,{"$f":"'all port'!K18","v":"2026-03-29"},null,{"$f":"'all port'!M18","v":"2026-04-02"},null,{"$f":"'all port'!O18","v":"2026-04-06"}]
[null,"● CFS CUT ： 17:00　■ YOKOHAMA : POD & Unstuffing CFS will be TOKYO, and cargoes will be transferred to YOKOHAMA CFS."]
[null,"VESSEL",null,null,null,null,"VOY",null,"SHENZHEN",null,"SHEKOU",null,"NAGOYA"]
[null,null,null,null,null,null,null,null,"● CUT",null,"SAILING"]
[null,{"$f":"'all port'!B22","v":"TS CHIBA"},null,null,null,null,{"$f":"'all port'!G22","v":"26002N"},null,{"$f":"'all port'!I22","v":"2026-02-05"},null,{"$f":"'all port'!K22","v":"2026-02-11"},null,{"$f":"'all port'!M22","v":"2026-02-17"}]
[null,{"$f":"'all port'!B23","v":"TS MAWEI"},null,null,null,null,{"$f":"'all port'!G23","v":"26002N"},null,{"$f":"'all port'!I23","v":"2026-02-09"},null,{"$f":"'all port'!K23","v":"2026-02-16"},null,{"$f":"'all port'!M23","v":"2026-02-23"}]
[null,{"$f":"'all port'!B24","v":"TS CHIBA"},null,null,null,null,{"$f":"'all port'!G24","v":"26003N"},null,{"$f":"'all port'!I24","v":"2026-02-26"},null,{"$f":"'all port'!K24","v":"2026-03-05"},null,{"$f":"'all port'!M24","v":"2026-03-11"}]
[null,{"$f":"'all port'!B25","v":"TS LIANYUNGANG "},null,null,null,null,{"$f":"'all port'!G25","v":"26006N"},null,{"$f":"'all port'!I25","v":"2026-03-05"},null,{"$f":"'all port'!K25","v":"2026-03-12"},null,{"$f":"'all port'!M25","v":"2026-03-18"}]
[null,{"$f":"'all port'!B26","v":"TS CHIBA"},null,null,null,null,{"$f":"'all port'!G26","v":"26004N"},null,{"$f":"'all port'!I26","v":"2026-03-12"},null,{"$f":"'all port'!K26","v":"2026-03-19"},null,{"$f":"'all port'!M26","v":"2026-03-25"}]
[null,{"$f":"'all port'!B27","v":"TS LIANYUNGANG "},null,null,null,null,{"$f":"'all port'!G27","v":"26007N"},null,{"$f":"'all port'!I27","v":"2026-03-19"},null,{"$f":"'all port'!K27","v":"2026-03-26"},null,{"$f":"'all port'!M27","v":"2026-04-01"}]
[null,{"$f":"'all port'!B28","v":"TS CHIBA"},null,null,null,null,{"$f":"'all port'!G28","v":"26005N"},null,{"$f":"'all port'!I28","v":"2026-03-26"},null,{"$f":"'all port'!K28","v":"2026-04-02"},null,{"$f":"'all port'!M28","v":"2026-04-07"}]
[null,"● CFS CUT ： 17:00"]
[null,"VESSEL",null,null,null,null,"VOY",null,"SHENZHEN",null,"SHEKOU",null,"OSAKA",null,"■"]
[null,null,null,null,null,null,null,null,"● CUT",null,"SAILING",null,null,null,"KOBE"]
[null,{"$f":"'all port'!B32","v":"TAICHUNG"},null,null,null,null,{"$f":"'all port'!G32","v":"421N"},null,{"$f":"'all port'!I32","v":"2026-02-05"},null,{"$f":"'all port'!K32","v":"2026-02-13"},null,{"$f":"'all port'!M32","v":"2026-02-17"},null,{"$f":"'all port'!O32","v":"2026-02-19"}]
[null,{"$f":"'all port'!B33","v":"TBA"},null,null,null,null,{"$f":"'all port'!G33","v":"TBA"},null,{"$f":"'all port'!I33","v":"2026-02-09"},null,{"$f":"'all port'!K33","v":"2026-02-14"},null,{"$f":"'all port'!M33","v":"2026-02-18"},null,{"$f":"'all port'!O33","v":"2026-02-20"}]
[null,{"$f":"'all port'!B34","v":"TS KOBE"},null,null,null,null,{"$f":"'all port'!G34","v":"26004N"},null,{"$f":"'all port'!I34","v":"2026-02-24"},null,{"$f":"'all port'!K34","v":"2026-02-28"},null,{"$f":"'all port'!M34","v":"2026-03-04"},null,{"$f":"'all port'!O34","v":"2026-03-06"}]
[null,{"$f":"'all port'!B35","v":"TAICHUNG"},null,null,null,null,{"$f":"'all port'!G35","v":"422N"},null,{"$f":"'all port'!I35","v":"2026-02-26"},null,{"$f":"'all port'!K35","v":"2026-03-04"},null,{"$f":"'all port'!M35","v":"2026-03-08"},null,{"$f":"'all port'!O35","v":"2026-03-10"}]
[null,{"$f":"'all port'!B36","v":"TS HAKATA"},null,null,null,null,{"$f":"'all port'!G36","v":"26004N"},null,{"$f":"'all port'!I36","v":"2026-03-03"},null,{"$f":"'all port'!K36","v":"2026-03-07"},null,{"$f":"'all port'!M36","v":"2026-03-10"},null,{"$f":"'all port'!O36","v":"2026-03-12"}]
[null,{"$f":"'all port'!B37","v":"INTERASIA RESILIENCE"},null,null,null,null,{"$f":"'all port'!G37","v":"N076"},null,{"$f":"'all port'!I37","v":"2026-03-05"},null,{"$f":"'all port'!K37","v":"2026-03-11"},null,{"$f":"'all port'!M37","v":"2026-03-15"},null,{"$f":"'all port'!O37","v":"2026-03-17"}]
[null,{"$f":"'all port'!B38","v":"TBA"},null,null,null,null,{"$f":"'all port'!G38","v":"TBA"},null,{"$f":"'all port'!I38","v":"2026-03-10"},null,{"$f":"'all port'!K38","v":"2026-03-14"},null,{"$f":"'all port'!M38","v":"2026-03-17"},null,{"$f":"'all port'!O38","v":"2026-03-19"}]
[null,{"$f":"'all port'!B39","v":"TBA"},null,null,null,null,{"$f":"'all port'!G39","v":"TBA"},null,{"$f":"'all port'!I39","v":"2026-03-12"},null,{"$f":"'all port'!K39","v":"2026-03-18"},null,{"$f":"'all port'!M39","v":"2026-03-22"},null,{"$f":"'all port'!O39","v":"2026-03-24"}]
[null,{"$f":"'all port'!B40","v":"TBA"},null,null,null,null,{"$f":"'all port'!G40","v":"TBA"},null,{"$f":"'all port'!I40","v":"2026-03-17"},null,{"$f":"'all port'!K40","v":"2026-03-21"},null,{"$f":"'all port'!M40","v":"2026-03-24"},null,{"$f":"'all port'!O40","v":"2026-03-26"}]
[null,{"$f":"'all port'!B41","v":"TBA"},null,null,null,null,{"$f":"'all port'!G41","v":"TBA"},null,{"$f":"'all port'!I41","v":"2026-03-19"},null,{"$f":"'all port'!K41","v":"2026-03-25"},null,{"$f":"'all port'!M41","v":"2026-03-29"},null,{"$f":"'all port'!O41","v":"2026-03-31"}]
[null,"● CFS CUT ： 17:00　■ KOBE : POD & Unstuffing CFS will be OSAKA, and cargoes will be transferred to KOBE CFS."]

{"sheet":"SHZ","index":2,"n_rows":35,"n_cols":11,"rows_kept":35,"cut":false,"hidden":false,"merged":[[27,8,27,9],[27,2,27,3],[27,4,27,5],[27,6,27,7],[1,2,1,3],[1,4,1,5],[1,6,1,7],[14,2,14,3],[14,4,14,5],[14,6,14,7]]}
["SHENZHEN(深圳) to TOKYO [DIRECT SERVICE]",null,null,null,"    "]
["VESSEL","VOYAGE","SZP(开仓期）",null,"SZP(深圳) CUT",null,"SKU(蛇口) ETD",null,"TOKYO ETA","YOKOHAMA  ETA+(2天工作日）","CARRIER"]
["TS MAWEI","26002N","2026-02-06",6,"2026-02-09",2,"2026-02-16",2,"2026-02-21","2026-02-23","TSL(JTK2)"]
["TS SURABAYA","26003N","2026-02-24",3,"2026-02-24",3,"2026-03-01",1,"2026-03-05","2026-03-07","TSL(JTK2)"]
["TS CHIBA","26003N","2026-02-24",3,"2026-02-26",5,"2026-03-05",5,"2026-03-09","2026-03-11","TSL(JTK)"]
["TBA","TBA","2026-02-27",6,"2026-03-03",3,"2026-03-08",1,"2026-03-12","2026-03-14","TSL(JTK2)"]
["TS LIANYUNGANG","26006N","2026-03-03",3,"2026-03-05",5,"2026-03-12",5,"2026-03-16","2026-03-18","TSL(JTK)"]
["TS JOHOR","26003N","2026-03-06",6,"2026-03-10",3,"2026-03-15",1,"2026-03-19","2026-03-21","TSL(JTK2)"]
["TS CHIBA","26004N","2026-03-10",3,"2026-03-12",5,"2026-03-19",5,"2026-03-23","2026-03-25","TSL(JTK)"]
["TS SURABAYA","26004N","2026-03-13",6,"2026-03-17",3,"2026-03-22",1,"2026-03-26","2026-03-28","TSL(JTK2)"]
["TS LIANYUNGANG","26007N","2026-03-17",3,"2026-03-19",5,"2026-03-26",5,"2026-03-30","2026-04-01","TSL(JTK)"]
["TS MAWEI","26005N","2026-03-20",6,"2026-03-24",3,"2026-03-29",1,"2026-04-02","2026-04-04","TSL(JTK2)"]
["TS CHIBA","26005N","2026-03-24",3,"2026-03-26",5,"2026-04-02",5,"2026-04-06","2026-04-08","TSL(JTK)"]
["SHENZHEN(深圳) to OSAKA [DIRECT SERVICE]"]
["VESSEL","VOYAGE","SZP(开仓期）",null,"SZP(深圳) CUT",null,"SKU(蛇口) ETD",null,"OSAKA ETA","KOBE ETA+（2天工作日）","CARRIER"]
["TAICHUNG","421N","2026-02-03",3,"2026-02-05",5,"2026-02-13",6,"2026-02-17","2026-02-19","TSL(JTK3)"]
["TBA","TBA","2026-02-06",6,"2026-02-09",2,"2026-02-14",7,"2026-02-18","2026-02-20","TSL(JHTN)"]
["TS KOBE","26004N","2026-02-24",3,"2026-02-24",3,"2026-02-28",7,"2026-03-04","2026-03-06","TSL(JHTN)"]
["TAICHUNG","422N","2026-02-24",3,"2026-02-26",5,"2026-03-04",4,"2026-03-08","2026-03-10","TSL(JTK3)"]
["TS HAKATA","26004N","2026-02-27",6,"2026-03-03",3,"2026-03-07",7,"2026-03-10","2026-03-12","TSL(JHTN)"]
["INTERASIA RESILIENCE","N076","2026-03-03",3,"2026-03-05",5,"2026-03-11",4,"2026-03-15","2026-03-17","TSL(JTK3)"]
["TBA","TBA","2026-03-06",6,"2026-03-10",3,"2026-03-14",7,"2026-03-17","2026-03-19","TSL(JHTN)"]
["TBA","TBA","2026-03-10",3,"2026-03-12",5,"2026-03-18",4,"2026-03-22","2026-03-24","TSL(JTK3)"]
["TBA","TBA","2026-03-13",6,"2026-03-17",3,"2026-03-21",7,"2026-03-24","2026-03-26","TSL(JHTN)"]
["TBA","TBA","2026-03-17",3,"2026-03-19",5,"2026-03-25",4,"2026-03-29","2026-03-31","TSL(JTK3)"]
["TBA","TBA","2026-03-20",6,"2026-03-24",3,"2026-03-28",7,"2026-03-31","2026-04-02","TSL(JHTN)"]
["SHENZHEN(深圳) to NAGOYA [DIRECT SERVICE]"]
["VESSEL","VOYAGE","SZP(开仓期）",null,"SZP(深圳) CUT",null,"SKU(蛇口) ETD",null,"NAGOYA   ETA",null,"CARRIER"]
["TS CHIBA","26002N","2026-02-03",3,"2026-02-05",5,"2026-02-11",4,"2026-02-17",3,"TSL(JTK)"]
["TS MAWEI","26002N","2026-02-06",6,"2026-02-09",2,"2026-02-16",2,"2026-02-23",2,"TSL(JTK2)"]
["TS CHIBA","26003N","2026-02-24",3,"2026-02-26",5,"2026-03-05",5,"2026-03-11",4,"TSL(JTK)"]
["TS LIANYUNGANG ","26006N","2026-03-03",3,"2026-03-05",5,"2026-03-12",5,"2026-03-18",4,"TSL(JTK)"]
["TS CHIBA","26004N","2026-03-10",3,"2026-03-12",5,"2026-03-19",5,"2026-03-25",4,"TSL(JTK)"]
["TS LIANYUNGANG ","26007N","2026-03-17",3,"2026-03-19",5,"2026-03-26",5,"2026-04-01",4,"TSL(JTK)"]
["TS CHIBA","26005N","2026-03-24",3,"2026-03-26",5,"2026-04-02",5,"2026-04-07",3,"TSL(JTK)"]

{"sheet":"保存","index":3,"n_rows":19,"n_cols":6,"rows_kept":19,"cut":false,"hidden":false,"merged":[]}
["タイトル","FEBRUARY",null,"【 "," 】",{"$f":"D1&B1&E1","v":"【 FEBRUARY 】"}]
[null,"① 該当月を英語で入力（大文字)"]
["保存フォルダ名 1","R:\\01_基幹業務共通\\営業開発室発信情報\\IMPスケジュール作成\\"]
["保存フォルダ名 2","R:\\01_基幹業務共通\\営業開発室発信情報\\IMPスケジュール作成\\JP\\JP_"]
["保存フォルダ名 3","R:\\01_基幹業務共通\\営業開発室発信情報\\IMPスケジュール作成\\EN\\EN_"]
["保存フォルダ名 3",202602,"② 該当月を数字で入力 (yyyy/mm)"]
["保存ファイル名 A","\\Shenzhen_"]
["保存ファイル名 B","\\Shenzhen_jp_"]
["保存ファイル名 C","\\Shenzhen_en_"]
["保存ファイル名 D"]
["保存ファイル名 E"]
["保存ファイル名 F"]
["保存ファイル名 G"]
["拡張子 1",".xlsm"]
["拡張子 2",".pdf"]
[]
["保存名 1",{"$f":"B3&B6&B7&B6&B14","v":"R:\\01_基幹業務共通\\営業開発室発信情報\\IMPスケジュール作成\\202602\\Shenzhen_202602.xlsm"}]
["保存名 2",{"$f":"B4&B6&B8&B6&B15","v":"R:\\01_基幹業務共通\\営業開発室発信情報\\IMPスケジュール作成\\JP\\JP_202602\\Shenzhen_jp_202602.pdf"}]
["保存名 3",{"$f":"B5&B6&B9&B6&B15","v":"R:\\01_基幹業務共通\\営業開発室発信情報\\IMPスケジュール作成\\EN\\EN_202602\\Shenzhen_en_202602.pdf"}]

{"sheet":"作業","index":4,"n_rows":27,"n_cols":11,"rows_kept":27,"cut":false,"hidden":false,"merged":[]}
[null,null,null,null,null,null,null,null,"SHENZHEN発スケジュール作成手順"]
[null,null,null,null,null,null,null,null,1,"下記フォルダから前回作成スケジュールを開く。"]
[null,null,null,null,null,null,null,null,null,"R:\\01_基幹業務共通\\営業開発室発信情報\\IMPスケジュール作成"]
[null,null,null,null,null,null,null,null,2,"NTL香港のスケジュール処理"]
[null,null,null,null,null,null,null,null,null,"NTL香港のスケジュールには「数式」が含まているので前準備処理が必要。"]
[null,null,null,null,null,null,null,null,null,"1. 対象スケジュールのシート全体をコピー"]
[null,null,null,null,null,null,null,null,null,"2.「形式を選択して貼り付け(S)」を選び、「値 (V)」を選択して貼り付ける。"]
[null,null,null,null,null,null,null,null,null,"3. 数式が全て値になっていれば前準備処理完了。"]
[null,null,null,null,null,null,null,null,3,"「作業」シートの「1. 作業準備」ボタンとクリック。"]
[null,null,null,null,null,null,null,null,null,"以下のシートの過去データがクリアされる。"]
[null,null,null,null,null,null,null,null,null,"「SHZ」"]
[null,null,null,null,null,null,null,null,4,"「2. 保存データ処理」ボタンをクリック。「保存」シートに移動するので「保存」シートの下記セル情報を手入力。"]
[null,null,null,null,null,null,null,null,null,"セルB1","スケジュールの作成月を英語で入力（大文字)"]
[null,null,null,null,null,null,null,null,null,"セルB6","スケジュールの作成年月を入力（yyyymm)"]
[null,null,null,null,null,null,null,null,null,null,"(セルB6の情報は保存フォルダ情報と連携しているので必ず「yyyymm」で入力する。年月の間に「/ (スラッシュ)」は入れない。"]
[null,null,null,null,null,null,null,null,null,"※「保存」シートの上記セル以外のセル情報は変更しないでください。変更すると保存ができなくなります。"]
[null,null,null,null,null,null,null,null,5,"「保存」シート処理完了後、「作業シートに戻る」ボタンをクリック。「作業」シートに戻る。"]
[null,null,null,null,null,null,null,null,6,"「3. 貼付シート処理」ボタンをクリック。「SHZ」シートに移動。"]
[null,null,null,null,null,null,null,null,7,"NTL香港のスケジュールを「SHZ」シートの所定位置にそれぞれ貼付。"]
[null,null,null,null,null,null,null,null,null,"スケジュール貼付後、「作業シートに戻る」ボタンをクリック。「作業」シートに戻る。"]
[null,null,null,null,null,null,null,null,8,"「all port」シートに正しくデータが表示されているか確認。"]
[null,null,null,null,null,null,null,null,null,"データが正しく表示されていない場合や、エラーが表示されている場合は、「SHZ」シートのデータを修正する。"]
[null,null,null,null,null,null,null,null,null,"※どうしてもエラーが解消されない場合は、御社本社・森下部長に連絡をして対応を確認する。"]
[null,null,null,null,null,null,null,null,10,"全てのデータが「all port」に正しく表示されているのを確認後、「all port」シート右上の会社ロゴをクリック。保存マクロが起動。"]
[null,null,null,null,null,null,null,null,11,"保存されるPDFが表示されるので正しく表示されているか確認。表示内容に問題がなければPDFは閉じる。"]
[null,null,null,null,null,null,null,null,12,"「名前を付けて保存」ウィンドウが表示されるので、保存先フォルダが正しいか確認。問題がなければ保存。"]
[null,null,null,null,null,null,null,null,13,"作業完了。"]

{"sheet":"祝日","index":5,"n_rows":34,"n_cols":3,"rows_kept":34,"cut":false,"hidden":false,"merged":[]}
["祝日リスト",null,"https://www8.cao.go.jp/chosei/shukujitsu/gaiyou.html"]
["名称","日付"]
["正月休み","2024-12-30"]
["正月休み","2024-12-31"]
["元日","2025-01-01"]
["正月休み","2025-01-02"]
["正月休み","2025-01-03"]
["正月休み","2025-01-04"]
["成人の日","2025-01-13"]
["建国記念の日","2025-02-11"]
["天皇誕生日","2025-02-23"]
["休日","2025-02-24"]
["春分の日","2025-03-20"]
["昭和の日","2025-04-29"]
["憲法記念日","2025-05-03"]
["みどりの日","2025-05-04"]
["こどもの日","2025-05-05"]
["休日","2025-05-06"]
["海の日","2025-07-21"]
["山の日","2025-08-11"]
["敬老の日","2025-09-15"]
["秋分の日","2025-09-23"]
["スポーツの日","2025-10-13"]
["文化の日","2025-11-03"]
["勤労感謝の日","2025-11-23"]
["休日","2025-11-24"]
["正月休み","2025-12-30"]
["正月休み","2025-12-31"]
["元日(翌年)","2026-01-01"]
["正月休み(翌年)","2026-01-02"]
["正月休み(翌年)","2026-01-03"]
["正月休み(翌年)","2026-01-04"]
["成人の日(翌年)","2026-01-12"]
["建国記念の日(翌年)","2026-02-11"]