{"text_format":"1","workbook":"xlsx","n_sheets":9,"sheets":["all port","all port (EN)","成形版","加工(東)","加工(西)","加工(九)","貼付シート(HKG)","保存","作業"],"not_rendered":{"charts":0,"images":3,"macros":1,"external_links":0,"defined_names":2,"comments":0,"pivot_tables":0},"unopened":[],"bounds":{"document_bytes":16777216,"sheet_cells":100000,"rows_first":2000,"rows_last":500,"rows_between":2000,"halvings":0,"cell_chars":16384,"cell_head_chars":4096},"cells_cut":0,"cells_raw":0,"read":"whole","date_system":"1900"}

{"sheet":"all port","index":0,"n_rows":46,"n_cols":35,"rows_kept":46,"cut":false,"hidden":false,"merged":[[31,7,31,8],[31,1,31,6],[31,13,31,14],[34,7,35,8],[34,9,34,12],[34,13,35,14],[38,1,38,6],[38,7,38,8],[32,7,32,8],[31,9,31,10],[31,11,31,12],[32,9,32,10],[32,13,32,14],[32,11,32,12],[17,9,17,10],[16,7,16,8],[15,11,15,12],[3,29,3,34],[3,0,3,27],[4,0,4,27],[4,32,4,34],[4,29,4,31],[10,11,10,12],[10,15,10,16],[10,7,10,8],[10,9,10,10],[16,13,16,14],[11,13,11,14],[13,13,13,14],[15,13,15,14],[16,11,16,12],[12,17,12,18],[13,17,13,18],[14,17,14,18],[15,17,15,18],[11,17,11,18],[10,1,10,6],[10,13,10,14],[24,13,24,14],[12,15,12,16],[14,9,14,10],[12,1,12,6],[12,7,12,8],[12,9,12,10],[12,11,12,12],[12,13,12,14],[14,11,14,12],[14,13,14,14],[14,15,14,16],[15,15,15,16],[15,9,15,10],[15,1,15,6],[15,7,15,8],[14,1,14,6],[14,7,14,8],[16,15,16,16],[22,1,22,6],[23,1,23,6],[23,13,23,14],[24,1,24,6],[24,7,24,8],[24,9,24,10],[21,1,21,6],[21,7,21,8],[21,9,21,10],[21,11,21,12],[21,13,21,14],[22,7,22,8],[22,9,22,10],[22,11,22,12],[22,13,22,14],[22,15,22,16],[23,15,23,16],[20,9,20,10],[20,11,20,12],[9,17,9,18],[11,1,11,6],[11,7,11,8],[11,15,11,16],[6,1,7,6],[6,7,7,8],[6,9,6,12],[6,13,7,14],[6,15,7,16],[6,17,7,18],[7,9,7,10],[7,11,7,12],[8,1,8,6],[8,7,8,8],[8,9,8,10],[8,11,8,12],[8,13,8,14],[8,15,8,16],[8,17,8,18],[10,17,10,18],[11,9,11,10],[13,1,13,6],[13,7,13,8],[13,9,13,10],[13,11,13,12],[13,15,13,16],[9,1,9,6],[9,7,9,8],[9,9,9,10],[9,11,9,12],[9,13,9,14],[9,15,9,16],[11,11,11,12],[16,17,16,18],[17,1,17,6],[17,7,17,8],[17,11,17,12],[17,13,17,14],[17,17,17,18],[19,1,20,6],[19,7,20,8],[29,9,29,10],[29,11,29,12],[21,15,21,16],[26,15,26,16],[25,15,25,16],[24,15,24,16],[19,9,19,12],[19,13,20,14],[19,15,20,16],[26,1,26,6],[26,7,26,8],[26,9,26,10],[26,13,26,14],[25,1,25,6],[25,7,25,8],[25,9,25,10],[29,1,29,6],[29,7,29,8],[29,13,29,14],[29,15,29,16],[34,1,35,6],[32,1,32,6],[32,15,32,16],[31,15,31,16],[16,1,16,6],[16,9,16,10],[30,1,30,6],[30,7,30,8],[30,9,30,10],[30,11,30,12],[30,13,30,14],[30,15,30,16],[25,11,25,12],[25,13,25,14],[17,15,17,16],[26,11,26,12],[23,7,23,8],[23,9,23,10],[23,11,23,12],[24,11,24,12],[27,1,27,6],[27,7,27,8],[27,9,27,10],[27,11,27,12],[27,13,27,14],[27,15,27,16],[28,1,28,6],[28,7,28,8],[28,9,28,10],[28,11,28,12],[28,13,28,14],[28,15,28,16],[34,15,35,16],[36,1,36,6],[36,7,36,8],[36,9,36,10],[36,11,36,12],[36,15,36,16],[37,1,37,6],[37,7,37,8],[37,9,37,10],[37,11,37,12],[37,13,37,14],[37,15,37,16],[35,9,35,10],[35,11,35,12],[36,13,36,14],[40,1,40,6],[40,7,40,8],[40,9,40,10],[40,11,40,12],[40,13,40,14],[40,15,40,16],[38,9,38,10],[38,11,38,12],[38,13,38,14],[38,15,38,16],[39,1,39,6],[39,7,39,8],[39,9,39,10],[39,11,39,12],[39,13,39,14],[39,15,39,16]]}
[]
[]
[]
["HONG KONG",null,null,null,null,null,null,null,null,null,null,null,null,null,null,null,null,null,null,null,null,null,null,null,null,null,null,null,null,"IMPORT SAILING SCHEDULE"]
[{"$f":"保存!F1","v":"【 FEBRUARY 】"},null,null,null,null,null,null,null,null,null,null,null,null,null,null,null,null,null,null,null,null,null,null,null,null,null,null,null,null,"Date :",null,null,{"$f":"TODAY()","v":"2026-02-17"}]
[null,null,null,null,null,null,null,null,null,null,null,null,null,null,null,null,null,null,null,null,null,null,null,null,null,null,null,null,null,null,null,null,null,null,"※ SUBJECT TO ALTERATION WITH OR WITHOUT NOTICE"]
[null,"VESSEL",null,null,null,null,null,"VOY",null,"HONG KONG",null,null,null,"TOKYO",null,"YOKOHAMA",null,"NAGOYA",null,null,null,null,null,null,null,null,null,null,null,null,null,null,null,null,"※ CO-LOADの場合は搬入先が変更になります。"]
[null,null,null,null,null,null,null,null,null,"CUT",null,"SAILING",null,null,null,null,null,null,null,null,null,null,null,null,null,null,null,"<東京> "]
[null,{"$f":"IF(成形版!A3=0,\"TBA\",成形版!A3)","v":"TS LIANYUNGANG "},null,null,null,null,null,{"$f":"IF(成形版!B3=0,\"---\",成形版!B3)","v":"26006N"},null,{"$f":"IF(成形版!C3=0,\"---\",成形版!C3)","v":"2026-02-25"},null,{"$f":"IF(成形版!D3=0,\"---\",成形版!D3)","v":"2026-02-28"},null,{"$f":"IF(成形版!E3=0,\"---\",成形版!E3)","v":"2026-03-05"},null,{"$f":"IF(成形版!F3=0,\"---\",成形版!F3)","v":"2026-03-06"},null,{"$f":"IF(成形版!G3=0,\"---\",成形版!G3)","v":"2026-03-07"},null,null,null,null,null,null,null,null,null,"㈱国際エキスプレス 東京第一営業所"]
[null,{"$f":"IF(成形版!A4=0,\"TBA\",成形版!A4)","v":"TS CHIBA"},null,null,null,null,null,{"$f":"IF(成形版!B4=0,\"---\",成形版!B4)","v":"26003N"},null,{"$f":"IF(成形版!C4=0,\"---\",成形版!C4)","v":"2026-03-02"},null,{"$f":"IF(成形版!D4=0,\"---\",成形版!D4)","v":"2026-03-05"},null,{"$f":"IF(成形版!E4=0,\"---\",成形版!E4)","v":"2026-03-09"},null,{"$f":"IF(成形版!F4=0,\"---\",成形版!F4)","v":"2026-03-10"},null,{"$f":"IF(成形版!G4=0,\"---\",成形版!G4)","v":"2026-03-11"},null,null,null,null,null,null,null,null,null,"東京都大田区東海 5-1-1 大井海貨上屋1棟2階 "]
[null,{"$f":"IF(成形版!A5=0,\"TBA\",成形版!A5)","v":"WAN HAI 308 "},null,null,null,null,null,{"$f":"IF(成形版!B5=0,\"---\",成形版!B5)","v":"N055"},null,{"$f":"IF(成形版!C5=0,\"---\",成形版!C5)","v":"2026-03-04"},null,{"$f":"IF(成形版!D5=0,\"---\",成形版!D5)","v":"2026-03-06"},null,{"$f":"IF(成形版!E5=0,\"---\",成形版!E5)","v":"---"},null,{"$f":"IF(成形版!F5=0,\"---\",成形版!F5)","v":"---"},null,{"$f":"IF(成形版!G5=0,\"---\",成形版!G5)","v":"2026-03-13"},null,null,null,null,null,null,null,null,null,"NACCS : 1FWM5"]
[null,{"$f":"IF(成形版!A6=0,\"TBA\",成形版!A6)","v":"TS SURABAYA"},null,null,null,null,null,{"$f":"IF(成形版!B6=0,\"---\",成形版!B6)","v":"26003N"},null,{"$f":"IF(成形版!C6=0,\"---\",成形版!C6)","v":"2026-03-04"},null,{"$f":"IF(成形版!D6=0,\"---\",成形版!D6)","v":"2026-03-07"},null,{"$f":"IF(成形版!E6=0,\"---\",成形版!E6)","v":"2026-03-12"},null,{"$f":"IF(成形版!F6=0,\"---\",成形版!F6)","v":"2026-03-13"},null,{"$f":"IF(成形版!G6=0,\"---\",成形版!G6)","v":"---"},null,null,null,null,null,null,null,null,null,"TEL : 03-6412-9801   FAX : 03-6412-9802 "]
[null,{"$f":"IF(成形版!A7=0,\"TBA\",成形版!A7)","v":"TS MAWEI"},null,null,null,null,null,{"$f":"IF(成形版!B7=0,\"---\",成形版!B7)","v":"26004N"},null,{"$f":"IF(成形版!C7=0,\"---\",成形版!C7)","v":"2026-03-09"},null,{"$f":"IF(成形版!D7=0,\"---\",成形版!D7)","v":"2026-03-12"},null,{"$f":"IF(成形版!E7=0,\"---\",成形版!E7)","v":"2026-03-16"},null,{"$f":"IF(成形版!F7=0,\"---\",成形版!F7)","v":"2026-03-17"},null,{"$f":"IF(成形版!G7=0,\"---\",成形版!G7)","v":"2026-03-18"},null,null,null,null,null,null,null,null,null,"<横浜> "]
[null,{"$f":"IF(成形版!A8=0,\"TBA\",成形版!A8)","v":"WAN HAI 308"},null,null,null,null,null,{"$f":"IF(成形版!B8=0,\"---\",成形版!B8)","v":"N055"},null,{"$f":"IF(成形版!C8=0,\"---\",成形版!C8)","v":"2026-03-11"},null,{"$f":"IF(成形版!D8=0,\"---\",成形版!D8)","v":"2026-03-13"},null,{"$f":"IF(成形版!E8=0,\"---\",成形版!E8)","v":"---"},null,{"$f":"IF(成形版!F8=0,\"---\",成形版!F8)","v":"---"},null,{"$f":"IF(成形版!G8=0,\"---\",成形版!G8)","v":"2026-03-20"},null,null,null,null,null,null,null,null,null,"㈱国際エキスプレス 横浜営業所 山下埠頭 保税蔵置場"]
[null,{"$f":"IF(成形版!A9=0,\"TBA\",成形版!A9)","v":"TS JOHOR"},null,null,null,null,null,{"$f":"IF(成形版!B9=0,\"---\",成形版!B9)","v":"26003N"},null,{"$f":"IF(成形版!C9=0,\"---\",成形版!C9)","v":"2026-03-11"},null,{"$f":"IF(成形版!D9=0,\"---\",成形版!D9)","v":"2026-03-14"},null,{"$f":"IF(成形版!E9=0,\"---\",成形版!E9)","v":"2026-03-19"},null,{"$f":"IF(成形版!F9=0,\"---\",成形版!F9)","v":"2026-03-20"},null,{"$f":"IF(成形版!G9=0,\"---\",成形版!G9)","v":"---"},null,null,null,null,null,null,null,null,null,"横浜市中区山下町279番地1　NACCS : 2DW67"]
[null,{"$f":"IF(成形版!A10=0,\"TBA\",成形版!A10)","v":"TBA"},null,null,null,null,null,{"$f":"IF(成形版!B10=0,\"---\",成形版!B10)","v":"---"},null,{"$f":"IF(成形版!C10=0,\"---\",成形版!C10)","v":"---"},null,{"$f":"IF(成形版!D10=0,\"---\",成形版!D10)","v":"---"},null,{"$f":"IF(成形版!E10=0,\"---\",成形版!E10)","v":"---"},null,{"$f":"IF(成形版!F10=0,\"---\",成形版!F10)","v":"---"},null,{"$f":"IF(成形版!G10=0,\"---\",成形版!G10)","v":"---"},null,null,null,null,null,null,null,null,null,"TEL : 045-227-6580   FAX : 045-227-6034 "]
[null,{"$f":"IF(成形版!A11=0,\"TBA\",成形版!A11)","v":"TBA"},null,null,null,null,null,{"$f":"IF(成形版!B11=0,\"---\",成形版!B11)","v":"---"},null,{"$f":"IF(成形版!C11=0,\"---\",成形版!C11)","v":"---"},null,{"$f":"IF(成形版!D11=0,\"---\",成形版!D11)","v":"---"},null,{"$f":"IF(成形版!E11=0,\"---\",成形版!E11)","v":"---"},null,{"$f":"IF(成形版!F11=0,\"---\",成形版!F11)","v":"---"},null,{"$f":"IF(成形版!G11=0,\"---\",成形版!G11)","v":"---"},null,null,null,null,null,null,null,null,null,"<名古屋> "]
[null,{"$f":"IF(成形版!A12=0,\"TBA\",成形版!A12)","v":"TBA"},null,null,null,null,null,{"$f":"IF(成形版!B12=0,\"---\",成形版!B12)","v":"---"},null,{"$f":"IF(成形版!C12=0,\"---\",成形版!C12)","v":"---"},null,{"$f":"IF(成形版!D12=0,\"---\",成形版!D12)","v":"---"},null,{"$f":"IF(成形版!E12=0,\"---\",成形版!E12)","v":"---"},null,{"$f":"IF(成形版!F12=0,\"---\",成形版!F12)","v":"---"},null,{"$f":"IF(成形版!G12=0,\"---\",成形版!G12)","v":"---"},null,null,null,null,null,null,null,null,null,"伊勢湾海運㈱ 伊勢湾海運西名港 H/W "]
[null,null,null,null,null,null,null,null,null,null,null,null,null,null,null,null,null,null,null,null,null,null,null,null,null,null,null,"愛知県海部郡飛島村東浜 1-6-1　NACCS : 5EWD2"]
[null,"VESSEL",null,null,null,null,null,"VOY",null,"HONG KONG",null,null,null,"OSAKA",null,"KOBE",null,null,null,null,null,null,null,null,null,null,null,"TEL : 0567-55-2711   FAX : 0567-55-2714 "]
[null,null,null,null,null,null,null,null,null,"CUT",null,"SAILING",null,null,null,null,null,null,null,null,null,null,null,null,null,null,null,"<大阪> "]
[null,{"$f":"IF(成形版!I3=0,\"TBA\",成形版!I3)","v":"WAN HAI 102"},null,null,null,null,null,{"$f":"IF(成形版!J3=0,\"---\",成形版!J3)","v":"W416"},null,{"$f":"IF(成形版!K3=0,\"---\",成形版!K3)","v":"2026-02-16"},null,{"$f":"IF(成形版!L3=0,\"---\",成形版!L3)","v":"2026-02-18"},null,{"$f":"IF(成形版!M3=0,\"---\",成形版!M3)","v":"---"},null,{"$f":"IF(成形版!N3=0,\"---\",成形版!N3)","v":"2026-02-24"},null,null,null,null,null,null,null,null,null,null,null,"日東物流㈱　大阪総合物流センター "]
[null,{"$f":"IF(成形版!I4=0,\"TBA\",成形版!I4)","v":"TS KOBE"},null,null,null,null,null,{"$f":"IF(成形版!J4=0,\"---\",成形版!J4)","v":"26004N"},null,{"$f":"IF(成形版!K4=0,\"---\",成形版!K4)","v":"2026-02-25"},null,{"$f":"IF(成形版!L4=0,\"---\",成形版!L4)","v":"2026-02-28"},null,{"$f":"IF(成形版!M4=0,\"---\",成形版!M4)","v":"2026-03-05"},null,{"$f":"IF(成形版!N4=0,\"---\",成形版!N4)","v":"---"},null,null,null,null,null,null,null,null,null,null,null,"大阪市住之江区南港東 9-4-36　NACCS : 4IWM4 "]
[null,{"$f":"IF(成形版!I5=0,\"TBA\",成形版!I5)","v":"TS GUANGZHOU"},null,null,null,null,null,{"$f":"IF(成形版!J5=0,\"---\",成形版!J5)","v":"26002N"},null,{"$f":"IF(成形版!K5=0,\"---\",成形版!K5)","v":"2026-03-02"},null,{"$f":"IF(成形版!L5=0,\"---\",成形版!L5)","v":"2026-03-04"},null,{"$f":"IF(成形版!M5=0,\"---\",成形版!M5)","v":"2026-03-09"},null,{"$f":"IF(成形版!N5=0,\"---\",成形版!N5)","v":"---"},null,null,null,null,null,null,null,null,null,null,null,"TEL : 06-6612-2600   FAX : 06-6612-2605 "]
[null,{"$f":"IF(成形版!I6=0,\"TBA\",成形版!I6)","v":"TS KOBE"},null,null,null,null,null,{"$f":"IF(成形版!J6=0,\"---\",成形版!J6)","v":"26004N"},null,{"$f":"IF(成形版!K6=0,\"---\",成形版!K6)","v":"2026-03-02"},null,{"$f":"IF(成形版!L6=0,\"---\",成形版!L6)","v":"2026-03-04"},null,{"$f":"IF(成形版!M6=0,\"---\",成形版!M6)","v":"---"},null,{"$f":"IF(成形版!N6=0,\"---\",成形版!N6)","v":"2026-03-10"},null,null,null,null,null,null,null,null,null,null,null,"<神戸> "]
[null,{"$f":"IF(成形版!I7=0,\"TBA\",成形版!I7)","v":"TS HAKATA "},null,null,null,null,null,{"$f":"IF(成形版!J7=0,\"---\",成形版!J7)","v":"26004N"},null,{"$f":"IF(成形版!K7=0,\"---\",成形版!K7)","v":"2026-03-04"},null,{"$f":"IF(成形版!L7=0,\"---\",成形版!L7)","v":"2026-03-07"},null,{"$f":"IF(成形版!M7=0,\"---\",成形版!M7)","v":"2026-03-12"},null,{"$f":"IF(成形版!N7=0,\"---\",成形版!N7)","v":"---"},null,null,null,null,null,null,null,null,null,null,null,"㈱カンロジ 摩耶2号上屋 "]
[null,{"$f":"IF(成形版!I8=0,\"TBA\",成形版!I8)","v":"TS GUANGZHOU"},null,null,null,null,null,{"$f":"IF(成形版!J8=0,\"---\",成形版!J8)","v":"26002N"},null,{"$f":"IF(成形版!K8=0,\"---\",成形版!K8)","v":"2026-03-04"},null,{"$f":"IF(成形版!L8=0,\"---\",成形版!L8)","v":"2026-03-07"},null,{"$f":"IF(成形版!M8=0,\"---\",成形版!M8)","v":"---"},null,{"$f":"IF(成形版!N8=0,\"---\",成形版!N8)","v":"2026-03-13"},null,null,null,null,null,null,null,null,null,null,null,"神戸市東灘区摩耶埠頭　NACCS : 3DW30 "]
[null,{"$f":"IF(成形版!I9=0,\"TBA\",成形版!I9)","v":"TAICHUNG"},null,null,null,null,null,{"$f":"IF(成形版!J9=0,\"---\",成形版!J9)","v":"422N"},null,{"$f":"IF(成形版!K9=0,\"---\",成形版!K9)","v":"2026-03-09"},null,{"$f":"IF(成形版!L9=0,\"---\",成形版!L9)","v":"2026-03-11"},null,{"$f":"IF(成形版!M9=0,\"---\",成形版!M9)","v":"2026-03-16"},null,{"$f":"IF(成形版!N9=0,\"---\",成形版!N9)","v":"---"},null,null,null,null,null,null,null,null,null,null,null,"TEL : 078-881-7121   FAX : 078-871-5240"]
[null,{"$f":"IF(成形版!I10=0,\"TBA\",成形版!I10)","v":"WAN HAI 102"},null,null,null,null,null,{"$f":"IF(成形版!J10=0,\"---\",成形版!J10)","v":"W416"},null,{"$f":"IF(成形版!K10=0,\"---\",成形版!K10)","v":"2026-03-11"},null,{"$f":"IF(成形版!L10=0,\"---\",成形版!L10)","v":"2026-03-14"},null,{"$f":"IF(成形版!M10=0,\"---\",成形版!M10)","v":"2026-03-19"},null,{"$f":"IF(成形版!N10=0,\"---\",成形版!N10)","v":"---"},null,null,null,null,null,null,null,null,null,null,null,"<博多> "]
[null,{"$f":"IF(成形版!I11=0,\"TBA\",成形版!I11)","v":"TAICHUNG"},null,null,null,null,null,{"$f":"IF(成形版!J11=0,\"---\",成形版!J11)","v":"422N"},null,{"$f":"IF(成形版!K11=0,\"---\",成形版!K11)","v":"2026-03-11"},null,{"$f":"IF(成形版!L11=0,\"---\",成形版!L11)","v":"2026-03-14"},null,{"$f":"IF(成形版!M11=0,\"---\",成形版!M11)","v":"---"},null,{"$f":"IF(成形版!N11=0,\"---\",成形版!N11)","v":"2026-03-20"},null,null,null,null,null,null,null,null,null,null,null,"山九㈱　福岡物流センター H.W."]
[null,{"$f":"IF(成形版!I12=0,\"TBA\",成形版!I12)","v":"TBA"},null,null,null,null,null,{"$f":"IF(成形版!J12=0,\"---\",成形版!J12)","v":"---"},null,{"$f":"IF(成形版!K12=0,\"---\",成形版!K12)","v":"---"},null,{"$f":"IF(成形版!L12=0,\"---\",成形版!L12)","v":"---"},null,{"$f":"IF(成形版!M12=0,\"---\",成形版!M12)","v":"---"},null,{"$f":"IF(成形版!N12=0,\"---\",成形版!N12)","v":"---"},null,null,null,null,null,null,null,null,null,null,null,"福岡市東区箱崎ふ頭4丁目5-9　NACCS : 6TWH7"]
[null,{"$f":"IF(成形版!I13=0,\"TBA\",成形版!I13)","v":"TBA"},null,null,null,null,null,{"$f":"IF(成形版!J13=0,\"---\",成形版!J13)","v":"---"},null,{"$f":"IF(成形版!K13=0,\"---\",成形版!K13)","v":"---"},null,{"$f":"IF(成形版!L13=0,\"---\",成形版!L13)","v":"---"},null,{"$f":"IF(成形版!M13=0,\"---\",成形版!M13)","v":"---"},null,{"$f":"IF(成形版!N13=0,\"---\",成形版!N13)","v":"---"},null,null,null,null,null,null,null,null,null,null,null,"TEL : 092-641-5420   FAX : 092-641-541"]
[null,{"$f":"IF(成形版!I14=0,\"TBA\",成形版!I14)","v":"TBA"},null,null,null,null,null,{"$f":"IF(成形版!J14=0,\"---\",成形版!J14)","v":"---"},null,{"$f":"IF(成形版!K14=0,\"---\",成形版!K14)","v":"---"},null,{"$f":"IF(成形版!L14=0,\"---\",成形版!L14)","v":"---"},null,{"$f":"IF(成形版!M14=0,\"---\",成形版!M14)","v":"---"},null,{"$f":"IF(成形版!N14=0,\"---\",成形版!N14)","v":"---"},null,null,null,null,null,null,null,null,null,null,null,"<門司> "]
[null,null,null,null,null,null,null,null,null,null,null,null,null,null,null,null,null,null,null,null,null,null,null,null,null,null,null,"門菱港運㈱　太刀浦NO.2 H/W "]
[null,"VESSEL",null,null,null,null,null,"VOY",null,"HONG KONG",null,null,null,"MOJI",null,"HAKATA",null,null,null,null,null,null,null,null,null,null,null,"北九州市門司区太刀浦海岸66　NACCS : 6CW17 "]
[null,null,null,null,null,null,null,null,null,"CUT",null,"SAILING",null,null,null,null,null,null,null,null,null,null,null,null,null,null,null,"TEL : 093-331-1821 FAX : 093-331-1636"]
[null,{"$f":"IF(成形版!P3=0,\"TBA\",成形版!P3)","v":"GREEN CELEBRITY"},null,null,null,null,null,{"$f":"IF(成形版!Q3=0,\"---\",成形版!Q3)","v":"N119"},null,{"$f":"IF(成形版!R3=0,\"---\",成形版!R3)","v":"2026-03-02"},null,{"$f":"IF(成形版!S3=0,\"---\",成形版!S3)","v":"2026-03-06"},null,{"$f":"IF(成形版!T3=0,\"---\",成形版!T3)","v":"2026-03-14"},null,{"$f":"IF(成形版!U3=0,\"---\",成形版!U3)","v":"2026-03-14"}]
[null,{"$f":"IF(成形版!P4=0,\"TBA\",成形版!P4)","v":"WAN HAI 283"},null,null,null,null,null,{"$f":"IF(成形版!Q4=0,\"---\",成形版!Q4)","v":"N108"},null,{"$f":"IF(成形版!R4=0,\"---\",成形版!R4)","v":"2026-03-09"},null,{"$f":"IF(成形版!S4=0,\"---\",成形版!S4)","v":"2026-03-13"},null,{"$f":"IF(成形版!T4=0,\"---\",成形版!T4)","v":"2026-03-21"},null,{"$f":"IF(成形版!U4=0,\"---\",成形版!U4)","v":"2026-03-21"},null,null,null,null,null,null,null,null,null,null,null,"【サービス内容, 営業に関するお問い合わせ】"]
[null,{"$f":"IF(成形版!P5=0,\"TBA\",成形版!P5)","v":"TBA"},null,null,null,null,null,{"$f":"IF(成形版!Q5=0,\"---\",成形版!Q5)","v":"---"},null,{"$f":"IF(成形版!R5=0,\"---\",成形版!R5)","v":"---"},null,{"$f":"IF(成形版!S5=0,\"---\",成形版!S5)","v":"---"},null,{"$f":"IF(成形版!T5=0,\"---\",成形版!T5)","v":"---"},null,{"$f":"IF(成形版!U5=0,\"---\",成形版!U5)","v":"---"},null,null,null,null,null,null,null,null,null,null,null,"東京本社",null,"TEL : 03-3276-5946"]
[null,{"$f":"IF(成形版!P6=0,\"TBA\",成形版!P6)","v":"TBA"},null,null,null,null,null,{"$f":"IF(成形版!Q6=0,\"---\",成形版!Q6)","v":"---"},null,{"$f":"IF(成形版!R6=0,\"---\",成形版!R6)","v":"---"},null,{"$f":"IF(成形版!S6=0,\"---\",成形版!S6)","v":"---"},null,{"$f":"IF(成形版!T6=0,\"---\",成形版!T6)","v":"---"},null,{"$f":"IF(成形版!U6=0,\"---\",成形版!U6)","v":"---"},null,null,null,null,null,null,null,null,null,null,null,"横浜支店",null,"TEL: 045-226-2051"]
[null,{"$f":"IF(成形版!P7=0,\"TBA\",成形版!P7)","v":"TBA"},null,null,null,null,null,{"$f":"IF(成形版!Q7=0,\"---\",成形版!Q7)","v":"---"},null,{"$f":"IF(成形版!R7=0,\"---\",成形版!R7)","v":"---"},null,{"$f":"IF(成形版!S7=0,\"---\",成形版!S7)","v":"---"},null,{"$f":"IF(成形版!T7=0,\"---\",成形版!T7)","v":"---"},null,{"$f":"IF(成形版!U7=0,\"---\",成形版!U7)","v":"---"},null,null,null,null,null,null,null,null,null,null,null,"名古屋支店",null,"TEL : 052-232-7730        "]
[null,null,null,null,null,null,null,null,null,null,null,null,null,null,null,null,null,null,null,null,null,null,null,null,null,null,null,"大阪本社",null,"TEL : 06-6260-4716"]
[null,null,null,null,null,null,null,null,null,null,null,null,null,null,null,null,null,null,null,null,null,null,null,null,null,null,null,"神戸支店",null,"TEL : 078-222-1071"]
[null,"【サービス内容, 営業に関するお問い合わせ】",null,null,null,null,null,null,null,null,null,null,null,null,null,null,null,null,null,null,null,null,null,null,null,null,null,"福岡営業所",null,"TEL : 092-436-4480 "]
[null,"東京・横浜・名古屋（東日本）揚げ ：",null,null,null,null,null,null,null,"東京本社　TEL : 03-3276-5943　FAX : 03-6684-7799　E-MAIL : tky-an@ntl-naigai.co.jp"]
[null,"大阪・神戸・九州（西日本）揚げ ：",null,null,null,null,null,null,null,"大阪本社　TEL : 06-6260-4716　FAX : 06-6260-4718　E-MAIL : osk-an@ntl-naigai.co.jp"]

{"sheet":"all port (EN)","index":1,"n_rows":41,"n_cols":35,"rows_kept":41,"cut":false,"hidden":false,"merged":[[40,1,40,6],[40,7,40,8],[40,9,40,10],[40,11,40,12],[40,13,40,14],[40,15,40,16],[39,1,39,6],[39,7,39,8],[39,9,39,10],[39,11,39,12],[39,13,39,14],[39,15,39,16],[38,1,38,6],[38,7,38,8],[38,9,38,10],[38,11,38,12],[38,13,38,14],[38,15,38,16],[37,1,37,6],[37,7,37,8],[37,9,37,10],[37,11,37,12],[37,13,37,14],[37,15,37,16],[36,1,36,6],[36,7,36,8],[36,9,36,10],[36,11,36,12],[36,13,36,14],[36,15,36,16],[34,1,35,6],[34,7,35,8],[34,9,34,12],[34,13,35,14],[34,15,35,16],[35,9,35,10],[35,11,35,12],[32,1,32,6],[32,7,32,8],[32,9,32,10],[32,11,32,12],[32,13,32,14],[32,15,32,16],[31,1,31,6],[31,7,31,8],[31,9,31,10],[31,11,31,12],[31,13,31,14],[31,15,31,16],[30,1,30,6],[30,7,30,8],[30,9,30,10],[30,11,30,12],[30,13,30,14],[30,15,30,16],[29,1,29,6],[29,7,29,8],[29,9,29,10],[29,11,29,12],[29,13,29,14],[29,15,29,16],[28,1,28,6],[28,7,28,8],[28,9,28,10],[28,11,28,12],[28,13,28,14],[28,15,28,16],[27,1,27,6],[27,7,27,8],[27,9,27,10],[27,11,27,12],[27,13,27,14],[27,15,27,16],[26,1,26,6],[26,7,26,8],[26,9,26,10],[26,11,26,12],[26,13,26,14],[26,15,26,16],[25,1,25,6],[25,7,25,8],[25,9,25,10],[25,11,25,12],[25,13,25,14],[25,15,25,16],[24,1,24,6],[24,7,24,8],[24,9,24,10],[24,11,24,12],[24,13,24,14],[24,15,24,16],[23,1,23,6],[23,7,23,8],[23,9,23,10],[23,11,23,12],[23,13,23,14],[23,15,23,16],[22,1,22,6],[22,7,22,8],[22,9,22,10],[22,11,22,12],[22,13,22,14],[22,15,22,16],[21,1,21,6],[21,7,21,8],[21,9,21,10],[21,11,21,12],[21,13,21,14],[21,15,21,16],[17,17,17,18],[19,1,20,6],[19,7,20,8],[19,9,19,12],[19,13,20,14],[19,15,20,16],[20,9,20,10],[20,11,20,12],[17,1,17,6],[17,7,17,8],[17,9,17,10],[17,11,17,12],[17,13,17,14],[17,15,17,16],[15,17,15,18],[16,1,16,6],[16,7,16,8],[16,9,16,10],[16,11,16,12],[16,13,16,14],[16,15,16,16],[16,17,16,18],[15,1,15,6],[15,7,15,8],[15,9,15,10],[15,11,15,12],[15,13,15,14],[15,15,15,16],[13,17,13,18],[14,1,14,6],[14,7,14,8],[14,9,14,10],[14,11,14,12],[14,13,14,14],[14,15,14,16],[14,17,14,18],[13,1,13,6],[13,7,13,8],[13,9,13,10],[13,11,13,12],[13,13,13,14],[13,15,13,16],[11,17,11,18],[12,1,12,6],[12,7,12,8],[12,9,12,10],[12,11,12,12],[12,13,12,14],[12,15,12,16],[12,17,12,18],[11,1,11,6],[11,7,11,8],[11,9,11,10],[11,11,11,12],[11,13,11,14],[11,15,11,16],[8,1,8,6],[8,7,8,8],[8,9,8,10],[8,11,8,12],[8,13,8,14],[8,15,8,16],[8,17,8,18],[9,17,9,18],[10,1,10,6],[10,7,10,8],[10,9,10,10],[10,11,10,12],[10,13,10,14],[10,15,10,16],[10,17,10,18],[9,1,9,6],[9,7,9,8],[9,9,9,10],[9,11,9,12],[9,13,9,14],[9,15,9,16],[3,0,3,27],[3,29,3,34],[4,0,4,27],[4,29,4,31],[4,32,4,34],[6,1,7,6],[6,7,7,8],[6,9,6,12],[6,13,7,14],[6,15,7,16],[6,17,7,18],[7,9,7,10],[7,11,7,12]]}
[]
[]
[]
["HONG KONG",null,null,null,null,null,null,null,null,null,null,null,null,null,null,null,null,null,null,null,null,null,null,null,null,null,null,null,null,"IMPORT SAILING SCHEDULE"]
[{"$f":"保存!F1","v":"【 FEBRUARY 】"},null,null,null,null,null,null,null,null,null,null,null,null,null,null,null,null,null,null,null,null,null,null,null,null,null,null,null,null,"Date :",null,null,{"$f":"TODAY()","v":"2026-02-17"}]
[null,null,null,null,null,null,null,null,null,null,null,null,null,null,null,null,null,null,null,null,null,null,null,null,null,null,null,null,null,null,null,null,null,null,"※ SUBJECT TO ALTERATION WITH OR WITHOUT NOTICE"]
[null,"VESSEL",null,null,null,null,null,"VOY",null,"HONG KONG",null,null,null,"TOKYO",null,"YOKOHAMA",null,"NAGOYA",null,null,null,null,null,null,null,null,null,null,null,null,null,null,null,null,"※ CO-LOADの場合は搬入先が変更になります。"]
[null,null,null,null,null,null,null,null,null,"CUT",null,"SAILING"]
[null,{"$f":"'all port'!B9","v":"TS LIANYUNGANG "},null,null,null,null,null,{"$f":"'all port'!H9","v":"26006N"},null,{"$f":"'all port'!J9","v":"2026-02-25"},null,{"$f":"'all port'!L9","v":"2026-02-28"},null,{"$f":"'all port'!N9","v":"2026-03-05"},null,{"$f":"'all port'!P9","v":"2026-03-06"},null,{"$f":"'all port'!R9","v":"2026-03-07"}]
[null,{"$f":"'all port'!B10","v":"TS CHIBA"},null,null,null,null,null,{"$f":"'all port'!H10","v":"26003N"},null,{"$f":"'all port'!J10","v":"2026-03-02"},null,{"$f":"'all port'!L10","v":"2026-03-05"},null,{"$f":"'all port'!N10","v":"2026-03-09"},null,{"$f":"'all port'!P10","v":"2026-03-10"},null,{"$f":"'all port'!R10","v":"2026-03-11"}]
[null,{"$f":"'all port'!B11","v":"WAN HAI 308 "},null,null,null,null,null,{"$f":"'all port'!H11","v":"N055"},null,{"$f":"'all port'!J11","v":"2026-03-04"},null,{"$f":"'all port'!L11","v":"2026-03-06"},null,{"$f":"'all port'!N11","v":"---"},null,{"$f":"'all port'!P11","v":"---"},null,{"$f":"'all port'!R11","v":"2026-03-13"}]
[null,{"$f":"'all port'!B12","v":"TS SURABAYA"},null,null,null,null,null,{"$f":"'all port'!H12","v":"26003N"},null,{"$f":"'all port'!J12","v":"2026-03-04"},null,{"$f":"'all port'!L12","v":"2026-03-07"},null,{"$f":"'all port'!N12","v":"2026-03-12"},null,{"$f":"'all port'!P12","v":"2026-03-13"},null,{"$f":"'all port'!R12","v":"---"}]
[null,{"$f":"'all port'!B13","v":"TS MAWEI"},null,null,null,null,null,{"$f":"'all port'!H13","v":"26004N"},null,{"$f":"'all port'!J13","v":"2026-03-09"},null,{"$f":"'all port'!L13","v":"2026-03-12"},null,{"$f":"'all port'!N13","v":"2026-03-16"},null,{"$f":"'all port'!P13","v":"2026-03-17"},null,{"$f":"'all port'!R13","v":"2026-03-18"}]
[null,{"$f":"'all port'!B14","v":"WAN HAI 308"},null,null,null,null,null,{"$f":"'all port'!H14","v":"N055"},null,{"$f":"'all port'!J14","v":"2026-03-11"},null,{"$f":"'all port'!L14","v":"2026-03-13"},null,{"$f":"'all port'!N14","v":"---"},null,{"$f":"'all port'!P14","v":"---"},null,{"$f":"'all port'!R14","v":"2026-03-20"}]
[null,{"$f":"'all port'!B15","v":"TS JOHOR"},null,null,null,null,null,{"$f":"'all port'!H15","v":"26003N"},null,{"$f":"'all port'!J15","v":"2026-03-11"},null,{"$f":"'all port'!L15","v":"2026-03-14"},null,{"$f":"'all port'!N15","v":"2026-03-19"},null,{"$f":"'all port'!P15","v":"2026-03-20"},null,{"$f":"'all port'!R15","v":"---"}]
[null,{"$f":"'all port'!B16","v":"TBA"},null,null,null,null,null,{"$f":"'all port'!H16","v":"---"},null,{"$f":"'all port'!J16","v":"---"},null,{"$f":"'all port'!L16","v":"---"},null,{"$f":"'all port'!N16","v":"---"},null,{"$f":"'all port'!P16","v":"---"},null,{"$f":"'all port'!R16","v":"---"}]
[null,{"$f":"'all port'!B17","v":"TBA"},null,null,null,null,null,{"$f":"'all port'!H17","v":"---"},null,{"$f":"'all port'!J17","v":"---"},null,{"$f":"'all port'!L17","v":"---"},null,{"$f":"'all port'!N17","v":"---"},null,{"$f":"'all port'!P17","v":"---"},null,{"$f":"'all port'!R17","v":"---"}]
[null,{"$f":"'all port'!B18","v":"TBA"},null,null,null,null,null,{"$f":"'all port'!H18","v":"---"},null,{"$f":"'all port'!J18","v":"---"},null,{"$f":"'all port'!L18","v":"---"},null,{"$f":"'all port'!N18","v":"---"},null,{"$f":"'all port'!P18","v":"---"},null,{"$f":"'all port'!R18","v":"---"}]
[]
[null,"VESSEL",null,null,null,null,null,"VOY",null,"HONG KONG",null,null,null,"OSAKA",null,"KOBE"]
[null,null,null,null,null,null,null,null,null,"CUT",null,"SAILING"]
[null,{"$f":"'all port'!B22","v":"WAN HAI 102"},null,null,null,null,null,{"$f":"'all port'!H22","v":"W416"},null,{"$f":"'all port'!J22","v":"2026-02-16"},null,{"$f":"'all port'!L22","v":"2026-02-18"},null,{"$f":"'all port'!N22","v":"---"},null,{"$f":"'all port'!P22","v":"2026-02-24"}]
[null,{"$f":"'all port'!B23","v":"TS KOBE"},null,null,null,null,null,{"$f":"'all port'!H23","v":"26004N"},null,{"$f":"'all port'!J23","v":"2026-02-25"},null,{"$f":"'all port'!L23","v":"2026-02-28"},null,{"$f":"'all port'!N23","v":"2026-03-05"},null,{"$f":"'all port'!P23","v":"---"}]
[null,{"$f":"'all port'!B24","v":"TS GUANGZHOU"},null,null,null,null,null,{"$f":"'all port'!H24","v":"26002N"},null,{"$f":"'all port'!J24","v":"2026-03-02"},null,{"$f":"'all port'!L24","v":"2026-03-04"},null,{"$f":"'all port'!N24","v":"2026-03-09"},null,{"$f":"'all port'!P24","v":"---"}]
[null,{"$f":"'all port'!B25","v":"TS KOBE"},null,null,null,null,null,{"$f":"'all port'!H25","v":"26004N"},null,{"$f":"'all port'!J25","v":"2026-03-02"},null,{"$f":"'all port'!L25","v":"2026-03-04"},null,{"$f":"'all port'!N25","v":"---"},null,{"$f":"'all port'!P25","v":"2026-03-10"}]
[null,{"$f":"'all port'!B26","v":"TS HAKATA "},null,null,null,null,null,{"$f":"'all port'!H26","v":"26004N"},null,{"$f":"'all port'!J26","v":"2026-03-04"},null,{"$f":"'all port'!L26","v":"2026-03-07"},null,{"$f":"'all port'!N26","v":"2026-03-12"},null,{"$f":"'all port'!P26","v":"---"}]
[null,{"$f":"'all port'!B27","v":"TS GUANGZHOU"},null,null,null,null,null,{"$f":"'all port'!H27","v":"26002N"},null,{"$f":"'all port'!J27","v":"2026-03-04"},null,{"$f":"'all port'!L27","v":"2026-03-07"},null,{"$f":"'all port'!N27","v":"---"},null,{"$f":"'all port'!P27","v":"2026-03-13"}]
[null,{"$f":"'all port'!B28","v":"TAICHUNG"},null,null,null,null,null,{"$f":"'all port'!H28","v":"422N"},null,{"$f":"'all port'!J28","v":"2026-03-09"},null,{"$f":"'all port'!L28","v":"2026-03-11"},null,{"$f":"'all port'!N28","v":"2026-03-16"},null,{"$f":"'all port'!P28","v":"---"}]
[null,{"$f":"'all port'!B29","v":"WAN HAI 102"},null,null,null,null,null,{"$f":"'all port'!H29","v":"W416"},null,{"$f":"'all port'!J29","v":"2026-03-11"},null,{"$f":"'all port'!L29","v":"2026-03-14"},null,{"$f":"'all port'!N29","v":"2026-03-19"},null,{"$f":"'all port'!P29","v":"---"}]
[null,{"$f":"'all port'!B30","v":"TAICHUNG"},null,null,null,null,null,{"$f":"'all port'!H30","v":"422N"},null,{"$f":"'all port'!J30","v":"2026-03-11"},null,{"$f":"'all port'!L30","v":"2026-03-14"},null,{"$f":"'all port'!N30","v":"---"},null,{"$f":"'all port'!P30","v":"2026-03-20"}]
[null,{"$f":"'all port'!B31","v":"TBA"},null,null,null,null,null,{"$f":"'all port'!H31","v":"---"},null,{"$f":"'all port'!J31","v":"---"},null,{"$f":"'all port'!L31","v":"---"},null,{"$f":"'all port'!N31","v":"---"},null,{"$f":"'all port'!P31","v":"---"}]
[null,{"$f":"'all port'!B32","v":"TBA"},null,null,null,null,null,{"$f":"'all port'!H32","v":"---"},null,{"$f":"'all port'!J32","v":"---"},null,{"$f":"'all port'!L32","v":"---"},null,{"$f":"'all port'!N32","v":"---"},null,{"$f":"'all port'!P32","v":"---"}]
[null,{"$f":"'all port'!B33","v":"TBA"},null,null,null,null,null,{"$f":"'all port'!H33","v":"---"},null,{"$f":"'all port'!J33","v":"---"},null,{"$f":"'all port'!L33","v":"---"},null,{"$f":"'all port'!N33","v":"---"},null,{"$f":"'all port'!P33","v":"---"}]
[]
[null,"VESSEL",null,null,null,null,null,"VOY",null,"HONG KONG",null,null,null,"MOJI",null,"HAKATA"]
[null,null,null,null,null,null,null,null,null,"CUT",null,"SAILING"]
[null,{"$f":"'all port'!B37","v":"GREEN CELEBRITY"},null,null,null,null,null,{"$f":"'all port'!H37","v":"N119"},null,{"$f":"'all port'!J37","v":"2026-03-02"},null,{"$f":"'all port'!L37","v":"2026-03-06"},null,{"$f":"'all port'!N37","v":"2026-03-14"},null,{"$f":"'all port'!P37","v":"2026-03-14"}]
[null,{"$f":"'all port'!B38","v":"WAN HAI 283"},null,null,null,null,null,{"$f":"'all port'!H38","v":"N108"},null,{"$f":"'all port'!J38","v":"2026-03-09"},null,{"$f":"'all port'!L38","v":"2026-03-13"},null,{"$f":"'all port'!N38","v":"2026-03-21"},null,{"$f":"'all port'!P38","v":"2026-03-21"}]
[null,{"$f":"'all port'!B39","v":"TBA"},null,null,null,null,null,{"$f":"'all port'!H39","v":"---"},null,{"$f":"'all port'!J39","v":"---"},null,{"$f":"'all port'!L39","v":"---"},null,{"$f":"'all port'!N39","v":"---"},null,{"$f":"'all port'!P39","v":"---"}]
[null,{"$f":"'all port'!B40","v":"TBA"},null,null,null,null,null,{"$f":"'all port'!H40","v":"---"},null,{"$f":"'all port'!J40","v":"---"},null,{"$f":"'all port'!L40","v":"---"},null,{"$f":"'all port'!N40","v":"---"},null,{"$f":"'all port'!P40","v":"---"}]
[null,{"$f":"'all port'!B41","v":"TBA"},null,null,null,null,null,{"$f":"'all port'!H41","v":"---"},null,{"$f":"'all port'!J41","v":"---"},null,{"$f":"'all port'!L41","v":"---"},null,{"$f":"'all port'!N41","v":"---"},null,{"$f":"'all port'!P41","v":"---"}]

{"sheet":"成形版","index":2,"n_rows":11,"n_cols":21,"rows_kept":11,"cut":false,"hidden":false,"merged":[]}
["表示用（東京・横浜・名古屋）",null,"HK","HK","TK","YH","NG",null,"表示用 (大阪・神戸）",null,"HK","HK","OS","KB",null,"表示用 (門司・博多）",null,"HK","HK","MJ","HK"]
["Vessel","Voy","CUT","ETD","ETA","ETA","ETA",null,"Vessel","Voy","CUT","ETD","ETA","ETA",null,"Vessel","Voy","CUT","ETD","ETA","ETA"]
["TS LIANYUNGANG ","26006N","2026-02-25","2026-02-28","2026-03-05","2026-03-06","2026-03-07",null,"WAN HAI 102","W416","2026-02-16","2026-02-18","---","2026-02-24",null,"GREEN CELEBRITY","N119","2026-03-02","2026-03-06","2026-03-14","2026-03-14"]
["TS CHIBA","26003N","2026-03-02","2026-03-05","2026-03-09","2026-03-10","2026-03-11",null,"TS KOBE","26004N","2026-02-25","2026-02-28","2026-03-05","---",null,"WAN HAI 283","N108","2026-03-09","2026-03-13","2026-03-21","2026-03-21"]
["WAN HAI 308 ","N055","2026-03-04","2026-03-06","---","---","2026-03-13",null,"TS GUANGZHOU","26002N","2026-03-02","2026-03-04","2026-03-09","---"]
["TS SURABAYA","26003N","2026-03-04","2026-03-07","2026-03-12","2026-03-13","---",null,"TS KOBE","26004N","2026-03-02","2026-03-04","---","2026-03-10"]
["TS MAWEI","26004N","2026-03-09","2026-03-12","2026-03-16","2026-03-17","2026-03-18",null,"TS HAKATA ","26004N","2026-03-04","2026-03-07","2026-03-12","---"]
["WAN HAI 308","N055","2026-03-11","2026-03-13","---","---","2026-03-20",null,"TS GUANGZHOU","26002N","2026-03-04","2026-03-07","---","2026-03-13"]
["TS JOHOR","26003N","2026-03-11","2026-03-14","2026-03-19","2026-03-20","---",null,"TAICHUNG","422N","2026-03-09","2026-03-11","2026-03-16","---"]
[null,null,null,null,null,null,null,null,"WAN HAI 102","W416","2026-03-11","2026-03-14","2026-03-19","---"]
[null,null,null,null,null,null,null,null,"TAICHUNG","422N","2026-03-11","2026-03-14","---","2026-03-20"]

{"sheet":"加工(東)","index":3,"n_rows":26,"n_cols":16,"rows_kept":26,"cut":false,"hidden":false,"merged":[]}
["東京・横浜・名古屋スケジュール",null,null,null,null,null,null,null,null,"加工列 (東京・横浜・名古屋）",null,"HK","HK","TK","YH","NG"]
["東京","Vessel","Voy","CUT","ETD","ETA","ETA","ETA",null,"Vessel","Voy","CUT","ETD","ETA","ETA","ETA"]
["TK1",{"$f":"'貼付シート(HKG)'!C3","v":"SKIP"},{"$f":"'貼付シート(HKG)'!D3","v":"SKIP"},{"$f":"IF(B3=\"SKIP\",\"---\",'貼付シート(HKG)'!E3)","v":"---"},{"$f":"IF(B3=\"SKIP\",\"---\",'貼付シート(HKG)'!H3)","v":"---"},{"$f":"IF(B3=\"SKIP\",\"---\",'貼付シート(HKG)'!I3)","v":"---"},null,null,null,"TS LIANYUNGANG ","26006N","2026-02-25","2026-02-28","2026-03-05","2026-03-06","2026-03-07"]
["TK2",{"$f":"'貼付シート(HKG)'!C4","v":"SKIP"},{"$f":"'貼付シート(HKG)'!D4","v":"SKIP"},{"$f":"IF(B4=\"SKIP\",\"---\",'貼付シート(HKG)'!E4)","v":"---"},{"$f":"IF(B4=\"SKIP\",\"---\",'貼付シート(HKG)'!H4)","v":"---"},{"$f":"IF(B4=\"SKIP\",\"---\",'貼付シート(HKG)'!I4)","v":"---"},null,null,null,"TS CHIBA","26003N","2026-03-02","2026-03-05","2026-03-09","2026-03-10","2026-03-11"]
["TK3",{"$f":"'貼付シート(HKG)'!C5","v":"SKIP"},{"$f":"'貼付シート(HKG)'!D5","v":"SKIP"},{"$f":"IF(B5=\"SKIP\",\"---\",'貼付シート(HKG)'!E5)","v":"---"},{"$f":"IF(B5=\"SKIP\",\"---\",'貼付シート(HKG)'!H5)","v":"---"},{"$f":"IF(B5=\"SKIP\",\"---\",'貼付シート(HKG)'!I5)","v":"---"},null,null,null,"WAN HAI 308 ","N055","2026-03-04","2026-03-06","---","---","2026-03-13"]
["TK4",{"$f":"'貼付シート(HKG)'!C6","v":"TS LIANYUNGANG "},{"$f":"'貼付シート(HKG)'!D6","v":"26006N"},{"$f":"IF(B6=\"SKIP\",\"---\",'貼付シート(HKG)'!E6)","v":"2026-02-25"},{"$f":"IF(B6=\"SKIP\",\"---\",'貼付シート(HKG)'!H6)","v":"2026-02-28"},{"$f":"IF(B6=\"SKIP\",\"---\",'貼付シート(HKG)'!I6)","v":"2026-03-05"},null,null,null,"TS SURABAYA","26003N","2026-03-04","2026-03-07","2026-03-12","2026-03-13","---"]
["TK5",{"$f":"'貼付シート(HKG)'!C7","v":"TS CHIBA"},{"$f":"'貼付シート(HKG)'!D7","v":"26003N"},{"$f":"IF(B7=\"SKIP\",\"---\",'貼付シート(HKG)'!E7)","v":"2026-03-02"},{"$f":"IF(B7=\"SKIP\",\"---\",'貼付シート(HKG)'!H7)","v":"2026-03-05"},{"$f":"IF(B7=\"SKIP\",\"---\",'貼付シート(HKG)'!I7)","v":"2026-03-09"},null,null,null,"TS MAWEI","26004N","2026-03-09","2026-03-12","2026-03-16","2026-03-17","2026-03-18"]
["TK6",{"$f":"'貼付シート(HKG)'!C8","v":"TS SURABAYA"},{"$f":"'貼付シート(HKG)'!D8","v":"26003N"},{"$f":"IF(B8=\"SKIP\",\"---\",'貼付シート(HKG)'!E8)","v":"2026-03-04"},{"$f":"IF(B8=\"SKIP\",\"---\",'貼付シート(HKG)'!H8)","v":"2026-03-07"},{"$f":"IF(B8=\"SKIP\",\"---\",'貼付シート(HKG)'!I8)","v":"2026-03-12"},null,null,null,"WAN HAI 308","N055","2026-03-11","2026-03-13","---","---","2026-03-20"]
["TK7",{"$f":"'貼付シート(HKG)'!C9","v":"TS MAWEI"},{"$f":"'貼付シート(HKG)'!D9","v":"26004N"},{"$f":"IF(B9=\"SKIP\",\"---\",'貼付シート(HKG)'!E9)","v":"2026-03-09"},{"$f":"IF(B9=\"SKIP\",\"---\",'貼付シート(HKG)'!H9)","v":"2026-03-12"},{"$f":"IF(B9=\"SKIP\",\"---\",'貼付シート(HKG)'!I9)","v":"2026-03-16"},null,null,null,"TS JOHOR","26003N","2026-03-11","2026-03-14","2026-03-19","2026-03-20","---"]
["TK8",{"$f":"'貼付シート(HKG)'!C10","v":"TS JOHOR"},{"$f":"'貼付シート(HKG)'!D10","v":"26003N"},{"$f":"IF(B10=\"SKIP\",\"---\",'貼付シート(HKG)'!E10)","v":"2026-03-11"},{"$f":"IF(B10=\"SKIP\",\"---\",'貼付シート(HKG)'!H10)","v":"2026-03-14"},{"$f":"IF(B10=\"SKIP\",\"---\",'貼付シート(HKG)'!I10)","v":"2026-03-19"}]
["YH1",{"$f":"'貼付シート(HKG)'!C11","v":"SKIP"},{"$f":"'貼付シート(HKG)'!D11","v":"SKIP"},{"$f":"IF(B11=\"SKIP\",\"---\",'貼付シート(HKG)'!E11)","v":"---"},{"$f":"IF(B11=\"SKIP\",\"---\",'貼付シート(HKG)'!H11)","v":"---"},null,{"$f":"IF(B11=\"SKIP\",\"---\",'貼付シート(HKG)'!I11)","v":"---"}]
["YH2",{"$f":"'貼付シート(HKG)'!C12","v":"SKIP"},{"$f":"'貼付シート(HKG)'!D12","v":"SKIP"},{"$f":"IF(B12=\"SKIP\",\"---\",'貼付シート(HKG)'!E12)","v":"---"},{"$f":"IF(B12=\"SKIP\",\"---\",'貼付シート(HKG)'!H12)","v":"---"},null,{"$f":"IF(B12=\"SKIP\",\"---\",'貼付シート(HKG)'!I12)","v":"---"}]
["YH3",{"$f":"'貼付シート(HKG)'!C13","v":"SKIP"},{"$f":"'貼付シート(HKG)'!D13","v":"SKIP"},{"$f":"IF(B13=\"SKIP\",\"---\",'貼付シート(HKG)'!E13)","v":"---"},{"$f":"IF(B13=\"SKIP\",\"---\",'貼付シート(HKG)'!H13)","v":"---"},null,{"$f":"IF(B13=\"SKIP\",\"---\",'貼付シート(HKG)'!I13)","v":"---"}]
["YH4",{"$f":"'貼付シート(HKG)'!C14","v":"TS LIANYUNGANG "},{"$f":"'貼付シート(HKG)'!D14","v":"26006N"},{"$f":"IF(B14=\"SKIP\",\"---\",'貼付シート(HKG)'!E14)","v":"2026-02-25"},{"$f":"IF(B14=\"SKIP\",\"---\",'貼付シート(HKG)'!H14)","v":"2026-02-28"},null,{"$f":"IF(B14=\"SKIP\",\"---\",'貼付シート(HKG)'!I14)","v":"2026-03-06"}]
["YH5",{"$f":"'貼付シート(HKG)'!C15","v":"TS CHIBA"},{"$f":"'貼付シート(HKG)'!D15","v":"26003N"},{"$f":"IF(B15=\"SKIP\",\"---\",'貼付シート(HKG)'!E15)","v":"2026-03-02"},{"$f":"IF(B15=\"SKIP\",\"---\",'貼付シート(HKG)'!H15)","v":"2026-03-05"},null,{"$f":"IF(B15=\"SKIP\",\"---\",'貼付シート(HKG)'!I15)","v":"2026-03-10"}]
["YH6",{"$f":"'貼付シート(HKG)'!C16","v":"TS SURABAYA"},{"$f":"'貼付シート(HKG)'!D16","v":"26003N"},{"$f":"IF(B16=\"SKIP\",\"---\",'貼付シート(HKG)'!E16)","v":"2026-03-04"},{"$f":"IF(B16=\"SKIP\",\"---\",'貼付シート(HKG)'!H16)","v":"2026-03-07"},null,{"$f":"IF(B16=\"SKIP\",\"---\",'貼付シート(HKG)'!I16)","v":"2026-03-13"}]
["YH7",{"$f":"'貼付シート(HKG)'!C17","v":"TS MAWEI"},{"$f":"'貼付シート(HKG)'!D17","v":"26004N"},{"$f":"IF(B17=\"SKIP\",\"---\",'貼付シート(HKG)'!E17)","v":"2026-03-09"},{"$f":"IF(B17=\"SKIP\",\"---\",'貼付シート(HKG)'!H17)","v":"2026-03-12"},null,{"$f":"IF(B17=\"SKIP\",\"---\",'貼付シート(HKG)'!I17)","v":"2026-03-17"}]
["YH8",{"$f":"'貼付シート(HKG)'!C18","v":"TS JOHOR"},{"$f":"'貼付シート(HKG)'!D18","v":"26003N"},{"$f":"IF(B18=\"SKIP\",\"---\",'貼付シート(HKG)'!E18)","v":"2026-03-11"},{"$f":"IF(B18=\"SKIP\",\"---\",'貼付シート(HKG)'!H18)","v":"2026-03-14"},null,{"$f":"IF(B18=\"SKIP\",\"---\",'貼付シート(HKG)'!I18)","v":"2026-03-20"}]
["NG1",{"$f":"'貼付シート(HKG)'!C19","v":"SKIP"},{"$f":"'貼付シート(HKG)'!D19","v":"SKIP"},{"$f":"IF(B19=\"SKIP\",\"---\",'貼付シート(HKG)'!E27)","v":"---"},{"$f":"IF(B19=\"SKIP\",\"---\",'貼付シート(HKG)'!H19)","v":"---"},null,null,{"$f":"IF(B19=\"SKIP\",\"---\",'貼付シート(HKG)'!I19)","v":"---"}]
["NG2",{"$f":"'貼付シート(HKG)'!C20","v":"SKIP"},{"$f":"'貼付シート(HKG)'!D20","v":"SKIP"},{"$f":"IF(B20=\"SKIP\",\"---\",'貼付シート(HKG)'!E28)","v":"---"},{"$f":"IF(B20=\"SKIP\",\"---\",'貼付シート(HKG)'!H20)","v":"---"},null,null,{"$f":"IF(B20=\"SKIP\",\"---\",'貼付シート(HKG)'!I20)","v":"---"}]
["NG3",{"$f":"'貼付シート(HKG)'!C21","v":"SKIP"},{"$f":"'貼付シート(HKG)'!D21","v":"SKIP"},{"$f":"IF(B21=\"SKIP\",\"---\",'貼付シート(HKG)'!E29)","v":"---"},{"$f":"IF(B21=\"SKIP\",\"---\",'貼付シート(HKG)'!H21)","v":"---"},null,null,{"$f":"IF(B21=\"SKIP\",\"---\",'貼付シート(HKG)'!I21)","v":"---"}]
["NG4",{"$f":"'貼付シート(HKG)'!C22","v":"TS LIANYUNGANG "},{"$f":"'貼付シート(HKG)'!D22","v":"26006N"},{"$f":"IF(B22=\"SKIP\",\"---\",'貼付シート(HKG)'!E30)","v":"2026-02-25"},{"$f":"IF(B22=\"SKIP\",\"---\",'貼付シート(HKG)'!H22)","v":"2026-02-28"},null,null,{"$f":"IF(B22=\"SKIP\",\"---\",'貼付シート(HKG)'!I22)","v":"2026-03-07"}]
["NG5",{"$f":"'貼付シート(HKG)'!C23","v":"TS CHIBA"},{"$f":"'貼付シート(HKG)'!D23","v":"26003N"},{"$f":"IF(B23=\"SKIP\",\"---\",'貼付シート(HKG)'!E31)","v":"2026-03-02"},{"$f":"IF(B23=\"SKIP\",\"---\",'貼付シート(HKG)'!H23)","v":"2026-03-05"},null,null,{"$f":"IF(B23=\"SKIP\",\"---\",'貼付シート(HKG)'!I23)","v":"2026-03-11"}]
["NG6",{"$f":"'貼付シート(HKG)'!C24","v":"WAN HAI 308 "},{"$f":"'貼付シート(HKG)'!D24","v":"N055"},{"$f":"IF(B24=\"SKIP\",\"---\",'貼付シート(HKG)'!E32)","v":"2026-03-04"},{"$f":"IF(B24=\"SKIP\",\"---\",'貼付シート(HKG)'!H24)","v":"2026-03-06"},null,null,{"$f":"IF(B24=\"SKIP\",\"---\",'貼付シート(HKG)'!I24)","v":"2026-03-13"}]
["NG7",{"$f":"'貼付シート(HKG)'!C25","v":"TS MAWEI"},{"$f":"'貼付シート(HKG)'!D25","v":"26004N"},{"$f":"IF(B25=\"SKIP\",\"---\",'貼付シート(HKG)'!E33)","v":"2026-03-09"},{"$f":"IF(B25=\"SKIP\",\"---\",'貼付シート(HKG)'!H25)","v":"2026-03-12"},null,null,{"$f":"IF(B25=\"SKIP\",\"---\",'貼付シート(HKG)'!I25)","v":"2026-03-18"}]
["NG8",{"$f":"'貼付シート(HKG)'!C26","v":"WAN HAI 308"},{"$f":"'貼付シート(HKG)'!D26","v":"N055"},{"$f":"IF(B26=\"SKIP\",\"---\",'貼付シート(HKG)'!E34)","v":"2026-03-11"},{"$f":"IF(B26=\"SKIP\",\"---\",'貼付シート(HKG)'!H26)","v":"2026-03-13"},null,null,{"$f":"IF(B26=\"SKIP\",\"---\",'貼付シート(HKG)'!I26)","v":"2026-03-20"}]

{"sheet":"加工(西)","index":4,"n_rows":18,"n_cols":15,"rows_kept":18,"cut":false,"hidden":false,"merged":[]}
["大阪・神戸スケジュール",null,null,null,null,null,null,null,null,"加工列 (大阪・神戸）",null,"HK","HK","OS","KB"]
["東京","Vessel","Voy","CUT","ETD","ETA","ETA",null,null,"Vessel","Voy","CUT","ETD","ETA","ETA"]
["OS1",{"$f":"'貼付シート(HKG)'!C27","v":"SKIP"},{"$f":"'貼付シート(HKG)'!D27","v":"SKIP"},{"$f":"IF(B3=\"SKIP\",\"---\",'貼付シート(HKG)'!E27)","v":"---"},{"$f":"IF(B3=\"SKIP\",\"---\",'貼付シート(HKG)'!H27)","v":"---"},{"$f":"IF(B3=\"SKIP\",\"---\",'貼付シート(HKG)'!I27)","v":"---"},null,null,null,"WAN HAI 102","W416","2026-02-16","2026-02-18","---","2026-02-24"]
["OS2",{"$f":"'貼付シート(HKG)'!C28","v":"SKIP"},{"$f":"'貼付シート(HKG)'!D28","v":"SKIP"},{"$f":"IF(B4=\"SKIP\",\"---\",'貼付シート(HKG)'!E28)","v":"---"},{"$f":"IF(B4=\"SKIP\",\"---\",'貼付シート(HKG)'!H28)","v":"---"},{"$f":"IF(B4=\"SKIP\",\"---\",'貼付シート(HKG)'!I28)","v":"---"},null,null,null,"TS KOBE","26004N","2026-02-25","2026-02-28","2026-03-05","---"]
["OS3",{"$f":"'貼付シート(HKG)'!C29","v":"SKIP"},{"$f":"'貼付シート(HKG)'!D29","v":"SKIP"},{"$f":"IF(B5=\"SKIP\",\"---\",'貼付シート(HKG)'!E29)","v":"---"},{"$f":"IF(B5=\"SKIP\",\"---\",'貼付シート(HKG)'!H29)","v":"---"},{"$f":"IF(B5=\"SKIP\",\"---\",'貼付シート(HKG)'!I29)","v":"---"},null,null,null,"TS GUANGZHOU","26002N","2026-03-02","2026-03-04","2026-03-09","---"]
["OS4",{"$f":"'貼付シート(HKG)'!C30","v":"TS KOBE"},{"$f":"'貼付シート(HKG)'!D30","v":"26004N"},{"$f":"IF(B6=\"SKIP\",\"---\",'貼付シート(HKG)'!E30)","v":"2026-02-25"},{"$f":"IF(B6=\"SKIP\",\"---\",'貼付シート(HKG)'!H30)","v":"2026-02-28"},{"$f":"IF(B6=\"SKIP\",\"---\",'貼付シート(HKG)'!I30)","v":"2026-03-05"},null,null,null,"TS KOBE","26004N","2026-03-02","2026-03-04","---","2026-03-10"]
["OS5",{"$f":"'貼付シート(HKG)'!C31","v":"TS GUANGZHOU"},{"$f":"'貼付シート(HKG)'!D31","v":"26002N"},{"$f":"IF(B7=\"SKIP\",\"---\",'貼付シート(HKG)'!E31)","v":"2026-03-02"},{"$f":"IF(B7=\"SKIP\",\"---\",'貼付シート(HKG)'!H31)","v":"2026-03-04"},{"$f":"IF(B7=\"SKIP\",\"---\",'貼付シート(HKG)'!I31)","v":"2026-03-09"},null,null,null,"TS HAKATA ","26004N","2026-03-04","2026-03-07","2026-03-12","---"]
["OS6",{"$f":"'貼付シート(HKG)'!C32","v":"TS HAKATA "},{"$f":"'貼付シート(HKG)'!D32","v":"26004N"},{"$f":"IF(B8=\"SKIP\",\"---\",'貼付シート(HKG)'!E32)","v":"2026-03-04"},{"$f":"IF(B8=\"SKIP\",\"---\",'貼付シート(HKG)'!H32)","v":"2026-03-07"},{"$f":"IF(B8=\"SKIP\",\"---\",'貼付シート(HKG)'!I32)","v":"2026-03-12"},null,null,null,"TS GUANGZHOU","26002N","2026-03-04","2026-03-07","---","2026-03-13"]
["OS7",{"$f":"'貼付シート(HKG)'!C33","v":"TAICHUNG"},{"$f":"'貼付シート(HKG)'!D33","v":"422N"},{"$f":"IF(B9=\"SKIP\",\"---\",'貼付シート(HKG)'!E33)","v":"2026-03-09"},{"$f":"IF(B9=\"SKIP\",\"---\",'貼付シート(HKG)'!H33)","v":"2026-03-11"},{"$f":"IF(B9=\"SKIP\",\"---\",'貼付シート(HKG)'!I33)","v":"2026-03-16"},null,null,null,"TAICHUNG","422N","2026-03-09","2026-03-11","2026-03-16","---"]
["OS8",{"$f":"'貼付シート(HKG)'!C34","v":"WAN HAI 102"},{"$f":"'貼付シート(HKG)'!D34","v":"W416"},{"$f":"IF(B10=\"SKIP\",\"---\",'貼付シート(HKG)'!E34)","v":"2026-03-11"},{"$f":"IF(B10=\"SKIP\",\"---\",'貼付シート(HKG)'!H34)","v":"2026-03-14"},{"$f":"IF(B10=\"SKIP\",\"---\",'貼付シート(HKG)'!I34)","v":"2026-03-19"},null,null,null,"WAN HAI 102","W416","2026-03-11","2026-03-14","2026-03-19","---"]
["KB1",{"$f":"'貼付シート(HKG)'!C34","v":"WAN HAI 102"},{"$f":"'貼付シート(HKG)'!D34","v":"W416"},{"$f":"'貼付シート(HKG)'!E35","v":"2026-02-16"},{"$f":"IF(B11=\"SKIP\",\"---\",'貼付シート(HKG)'!H35)","v":"2026-02-18"},null,{"$f":"IF(B11=\"SKIP\",\"---\",'貼付シート(HKG)'!I35)","v":"2026-02-24"},null,null,"TAICHUNG","422N","2026-03-11","2026-03-14","---","2026-03-20"]
["KB2",{"$f":"'貼付シート(HKG)'!C35","v":"SKIP"},{"$f":"'貼付シート(HKG)'!D35","v":"SKIP"},{"$f":"'貼付シート(HKG)'!E36","v":"2026-02-18"},{"$f":"IF(B12=\"SKIP\",\"---\",'貼付シート(HKG)'!H36)","v":"---"},null,{"$f":"IF(B12=\"SKIP\",\"---\",'貼付シート(HKG)'!I36)","v":"---"}]
["KB3",{"$f":"'貼付シート(HKG)'!C36","v":"SKIP"},{"$f":"'貼付シート(HKG)'!D36","v":"SKIP"},{"$f":"'貼付シート(HKG)'!E37","v":"2026-02-23"},{"$f":"IF(B13=\"SKIP\",\"---\",'貼付シート(HKG)'!H37)","v":"---"},null,{"$f":"IF(B13=\"SKIP\",\"---\",'貼付シート(HKG)'!I37)","v":"---"}]
["KB4",{"$f":"'貼付シート(HKG)'!C37","v":"SKIP"},{"$f":"'貼付シート(HKG)'!D37","v":"SKIP"},{"$f":"'貼付シート(HKG)'!E38","v":"2026-02-25"},{"$f":"IF(B14=\"SKIP\",\"---\",'貼付シート(HKG)'!H38)","v":"---"},null,{"$f":"IF(B14=\"SKIP\",\"---\",'貼付シート(HKG)'!I38)","v":"---"}]
["KB5",{"$f":"'貼付シート(HKG)'!C38","v":"TS KOBE"},{"$f":"'貼付シート(HKG)'!D38","v":"26004N"},{"$f":"'貼付シート(HKG)'!E39","v":"2026-03-02"},{"$f":"IF(B15=\"SKIP\",\"---\",'貼付シート(HKG)'!H39)","v":"2026-03-04"},null,{"$f":"IF(B15=\"SKIP\",\"---\",'貼付シート(HKG)'!I39)","v":"2026-03-10"}]
["KB6",{"$f":"'貼付シート(HKG)'!C39","v":"TS GUANGZHOU"},{"$f":"'貼付シート(HKG)'!D39","v":"26002N"},{"$f":"'貼付シート(HKG)'!E40","v":"2026-03-04"},{"$f":"IF(B16=\"SKIP\",\"---\",'貼付シート(HKG)'!H40)","v":"2026-03-07"},null,{"$f":"IF(B16=\"SKIP\",\"---\",'貼付シート(HKG)'!I40)","v":"2026-03-13"}]
["KB7",{"$f":"'貼付シート(HKG)'!C40","v":"SKIP"},{"$f":"'貼付シート(HKG)'!D40","v":"SKIP"},{"$f":"'貼付シート(HKG)'!E41","v":"2026-03-09"},{"$f":"IF(B17=\"SKIP\",\"---\",'貼付シート(HKG)'!H41)","v":"---"},null,{"$f":"IF(B17=\"SKIP\",\"---\",'貼付シート(HKG)'!I41)","v":"---"}]
["KB8",{"$f":"'貼付シート(HKG)'!C41","v":"TAICHUNG"},{"$f":"'貼付シート(HKG)'!D41","v":"422N"},{"$f":"'貼付シート(HKG)'!E42","v":"2026-03-11"},{"$f":"IF(B18=\"SKIP\",\"---\",'貼付シート(HKG)'!H42)","v":"2026-03-14"},null,{"$f":"IF(B18=\"SKIP\",\"---\",'貼付シート(HKG)'!I42)","v":"2026-03-20"}]

{"sheet":"加工(九)","index":5,"n_rows":14,"n_cols":15,"rows_kept":14,"cut":false,"hidden":false,"merged":[]}
["門司・博多スケジュール",null,null,null,null,null,null,null,null,"加工列 (門司・博多）",null,"HK","HK","MJ","HK"]
["東京","Vessel","Voy","CUT","ETD","ETA","ETA",null,null,"Vessel","Voy","CUT","ETD","ETA","ETA"]
["MJI",{"$f":"'貼付シート(HKG)'!C43","v":"SKIP"},{"$f":"'貼付シート(HKG)'!D43","v":"SKIP"},{"$f":"'貼付シート(HKG)'!E43","v":"2026-02-16"},{"$f":"'貼付シート(HKG)'!H43","v":"2026-02-20"},{"$f":"'貼付シート(HKG)'!I43","v":"2026-02-28"},null,null,null,"GREEN CELEBRITY","N119","2026-03-02","2026-03-06","2026-03-14","2026-03-14"]
["MJ2",{"$f":"'貼付シート(HKG)'!C44","v":"SKIP"},{"$f":"'貼付シート(HKG)'!D44","v":"SKIP"},{"$f":"'貼付シート(HKG)'!E44","v":"2026-02-23"},{"$f":"'貼付シート(HKG)'!H44","v":"2026-02-27"},{"$f":"'貼付シート(HKG)'!I44","v":"2026-03-07"},null,null,null,"WAN HAI 283","N108","2026-03-09","2026-03-13","2026-03-21","2026-03-21"]
["MJI",{"$f":"'貼付シート(HKG)'!C45","v":"GREEN CELEBRITY"},{"$f":"'貼付シート(HKG)'!D45","v":"N119"},{"$f":"'貼付シート(HKG)'!E45","v":"2026-03-02"},{"$f":"'貼付シート(HKG)'!H45","v":"2026-03-06"},{"$f":"'貼付シート(HKG)'!I45","v":"2026-03-14"}]
["MJ3",{"$f":"'貼付シート(HKG)'!C46","v":"WAN HAI 283"},{"$f":"'貼付シート(HKG)'!D46","v":"N108"},{"$f":"'貼付シート(HKG)'!E46","v":"2026-03-09"},{"$f":"'貼付シート(HKG)'!H46","v":"2026-03-13"},{"$f":"'貼付シート(HKG)'!I46","v":"2026-03-21"}]
[]
[]
[]
[]
["HK1",{"$f":"'貼付シート(HKG)'!C47","v":"SKIP"},{"$f":"'貼付シート(HKG)'!D47","v":"SKIP"},{"$f":"'貼付シート(HKG)'!E47","v":"2026-02-16"},{"$f":"'貼付シート(HKG)'!H47","v":"2026-02-20"},null,{"$f":"'貼付シート(HKG)'!I47","v":"2026-02-28"}]
["HK2",{"$f":"'貼付シート(HKG)'!C48","v":"SKIP"},{"$f":"'貼付シート(HKG)'!D48","v":"SKIP"},{"$f":"'貼付シート(HKG)'!E48","v":"2026-02-23"},{"$f":"'貼付シート(HKG)'!H48","v":"2026-02-28"},null,{"$f":"'貼付シート(HKG)'!I48","v":"2026-03-08"}]
["HK3",{"$f":"'貼付シート(HKG)'!C49","v":"GREEN CELEBRITY"},{"$f":"'貼付シート(HKG)'!D49","v":"N119"},{"$f":"'貼付シート(HKG)'!E49","v":"2026-03-02"},{"$f":"'貼付シート(HKG)'!H49","v":"2026-03-06"},null,{"$f":"'貼付シート(HKG)'!I49","v":"2026-03-14"}]
["HK4",{"$f":"'貼付シート(HKG)'!C50","v":"WAN HAI 283"},{"$f":"'貼付シート(HKG)'!D50","v":"N108"},{"$f":"'貼付シート(HKG)'!E50","v":"2026-03-09"},{"$f":"'貼付シート(HKG)'!H50","v":"2026-03-13"},null,{"$f":"'貼付シート(HKG)'!I50","v":"2026-03-21"}]

{"sheet":"貼付シート(HKG)","index":6,"n_rows":50,"n_cols":9,"rows_kept":50,"cut":false,"hidden":false,"merged":[[0,0,0,8]]}
["JAPAN"]
["PORT",null,"VESSEL","VOYAGE","Hong Kong      CFS Closing\n(17:00)","SI Cut Off\n(17:00)","CY \n(Load Date)","ETD","ETA"]
["TOKYO","TK1","SKIP","SKIP","2026-02-16","2026-02-16","2026-02-18","2026-02-19","2026-02-23"]
[null,"TK2","SKIP","SKIP","2026-02-18","2026-02-18","2026-02-20","2026-02-20","2026-02-26"]
[null,"TK3","SKIP","SKIP","2026-02-23","2026-02-23","2026-02-25","2026-02-26","2026-03-02"]
[null,"TK4","TS LIANYUNGANG ","26006N","2026-02-25","2026-02-25","2026-02-27","2026-02-28","2026-03-05"]
[null,"TK5","TS CHIBA","26003N","2026-03-02","2026-03-02","2026-03-04","2026-03-05","2026-03-09"]
[null,"TK6","TS SURABAYA","26003N","2026-03-04","2026-03-04","2026-03-06","2026-03-07","2026-03-12"]
[null,"TK7","TS MAWEI","26004N","2026-03-09","2026-03-09","2026-03-11","2026-03-12","2026-03-16"]
[null,"TK8","TS JOHOR","26003N","2026-03-11","2026-03-11","2026-03-13","2026-03-14","2026-03-19"]
["YOKOHAMA","YH1","SKIP","SKIP","2026-02-16","2026-02-16","2026-02-18","2026-02-19","2026-02-24"]
[null,"YH2","SKIP","SKIP","2026-02-18","2026-02-18","2026-02-20","2026-02-20","2026-02-27"]
[null,"YH3","SKIP","SKIP","2026-02-23","2026-02-23","2026-02-25","2026-02-26","2026-03-03"]
[null,"YH4","TS LIANYUNGANG ","26006N","2026-02-25","2026-02-25","2026-02-27","2026-02-28","2026-03-06"]
[null,"YH5","TS CHIBA","26003N","2026-03-02","2026-03-02","2026-03-04","2026-03-05","2026-03-10"]
[null,"YH6","TS SURABAYA","26003N","2026-03-04","2026-03-04","2026-03-06","2026-03-07","2026-03-13"]
[null,"YH7","TS MAWEI","26004N","2026-03-09","2026-03-09","2026-03-11","2026-03-12","2026-03-17"]
[null,"YH8","TS JOHOR","26003N","2026-03-11","2026-03-11","2026-03-13","2026-03-14","2026-03-20"]
["NAGOYA","NG1","SKIP","SKIP","2026-02-16","2026-02-16","2026-02-18","2026-02-19","2026-02-25"]
[null,"NG2","SKIP","SKIP","2026-02-18","2026-02-18","2026-02-19","2026-02-23","2026-02-28"]
[null,"NG3","SKIP","SKIP","2026-02-23","2026-02-23","2026-02-25","2026-02-26","2026-03-04"]
[null,"NG4","TS LIANYUNGANG ","26006N","2026-02-25","2026-02-25","2026-02-26","2026-02-28","2026-03-07"]
[null,"NG5","TS CHIBA","26003N","2026-03-02","2026-03-02","2026-03-04","2026-03-05","2026-03-11"]
[null,"NG6","WAN HAI 308 ","N055","2026-03-04","2026-03-04","2026-03-05","2026-03-06","2026-03-13"]
[null,"NG7","TS MAWEI","26004N","2026-03-09","2026-03-09","2026-03-11","2026-03-12","2026-03-18"]
[null,"NG8","WAN HAI 308","N055","2026-03-11","2026-03-11","2026-03-12","2026-03-13","2026-03-20"]
["OSAKA","OS1","SKIP","SKIP","2026-02-16","2026-02-16","2026-02-17","2026-02-18","2026-02-23"]
[null,"OS2","SKIP","SKIP","2026-02-18","2026-02-18","2026-02-19","2026-02-21","2026-02-26"]
[null,"OS3","SKIP","SKIP","2026-02-23","2026-02-23","2026-02-24","2026-02-25","2026-03-02"]
[null,"OS4","TS KOBE","26004N","2026-02-25","2026-02-25","2026-02-26","2026-02-28","2026-03-05"]
[null,"OS5","TS GUANGZHOU","26002N","2026-03-02","2026-03-02","2026-03-03","2026-03-04","2026-03-09"]
[null,"OS6","TS HAKATA ","26004N","2026-03-04","2026-03-04","2026-03-05","2026-03-07","2026-03-12"]
[null,"OS7","TAICHUNG","422N","2026-03-09","2026-03-09","2026-03-10","2026-03-11","2026-03-16"]
[null,"OS8","WAN HAI 102","W416","2026-03-11","2026-03-11","2026-03-12","2026-03-14","2026-03-19"]
["KOBE","KB1","SKIP","SKIP","2026-02-16","2026-02-16","2026-02-17","2026-02-18","2026-02-24"]
[null,"KB2","SKIP","SKIP","2026-02-18","2026-02-18","2026-02-20","2026-02-21","2026-02-27"]
[null,"KB3","SKIP","SKIP","2026-02-23","2026-02-23","2026-02-24","2026-02-25","2026-03-03"]
[null,"KB4","TS KOBE","26004N","2026-02-25","2026-02-25","2026-02-27","2026-02-28","2026-03-06"]
[null,"KB5","TS GUANGZHOU","26002N","2026-03-02","2026-03-02","2026-03-03","2026-03-04","2026-03-10"]
[null,"KB6","SKIP","SKIP","2026-03-04","2026-03-04","2026-03-06","2026-03-07","2026-03-13"]
[null,"KB7","TAICHUNG","422N","2026-03-09","2026-03-09","2026-03-10","2026-03-11","2026-03-17"]
[null,"KB8","SKIP","SKIP","2026-03-11","2026-03-11","2026-03-13","2026-03-14","2026-03-20"]
["MOJI ","MJ1","SKIP","SKIP","2026-02-16","2026-02-16","2026-02-18","2026-02-20","2026-02-28"]
[null,"MJ2","SKIP","SKIP","2026-02-23","2026-02-23","2026-02-24","2026-02-27","2026-03-07"]
[null,"MJ3","GREEN CELEBRITY","N119","2026-03-02","2026-03-02","2026-03-03","2026-03-06","2026-03-14"]
[null,"MJ4","WAN HAI 283","N108","2026-03-09","2026-03-09","2026-03-10","2026-03-13","2026-03-21"]
["HAKATA","HK1","SKIP","SKIP","2026-02-16","2026-02-16","2026-02-18","2026-02-20","2026-02-28"]
[null,"HK2","SKIP","SKIP","2026-02-23","2026-02-23","2026-02-24","2026-02-28","2026-03-08"]
[null,"HK3","GREEN CELEBRITY","N119","2026-03-02","2026-03-02","2026-03-03","2026-03-06","2026-03-14"]
[null,"HK4","WAN HAI 283","N108","2026-03-09","2026-03-09","2026-03-10","2026-03-13","2026-03-21"]

{"sheet":"保存","index":7,"n_rows":19,"n_cols":6,"rows_kept":19,"cut":false,"hidden":false,"merged":[]}
["タイトル","FEBRUARY",null,"【 "," 】",{"$f":"D1&B1&E1","v":"【 FEBRUARY 】"}]
[null,"① 該当月を英語で入力（大文字)"]
["保存フォルダ名 1","R:\\01_基幹業務共通\\営業開発室発信情報\\IMPスケジュール作成\\"]
["保存フォルダ名 2","R:\\01_基幹業務共通\\営業開発室発信情報\\IMPスケジュール作成\\JP\\JP_"]
["保存フォルダ名 3","R:\\01_基幹業務共通\\営業開発室発信情報\\IMPスケジュール作成\\EN\\EN_"]
["保存フォルダ名 3",202602,"② 該当月を数字で入力 (yyyy/mm)"]
["保存ファイル名 A","\\Hong Kong_"]
["保存ファイル名 B","\\Hong Kong_jp_"]
["保存ファイル名 C","\\Hong Kong_en_"]
["保存ファイル名 D"]
["保存ファイル名 E"]
["保存ファイル名 F"]
["保存ファイル名 G"]
["拡張子 1",".xlsm"]
["拡張子 2",".pdf"]
[]
["保存名 1",{"$f":"B3&B6&B7&B6&B14","v":"R:\\01_基幹業務共通\\営業開発室発信情報\\IMPスケジュール作成\\202602\\Hong Kong_202602.xlsm"}]
["保存名 2",{"$f":"B4&B6&B8&B6&B15","v":"R:\\01_基幹業務共通\\営業開発室発信情報\\IMPスケジュール作成\\JP\\JP_202602\\Hong Kong_jp_202602.pdf"}]
["保存名 3",{"$f":"B5&B6&B9&B6&B15","v":"R:\\01_基幹業務共通\\営業開発室発信情報\\IMPスケジュール作成\\EN\\EN_202602\\Hong Kong_en_202602.pdf"}]

{"sheet":"作業","index":8,"n_rows":29,"n_cols":11,"rows_kept":29,"cut":false,"hidden":false,"merged":[]}
[null,null,null,null,null,null,null,null,"HONG KONG発スケジュール作成手順"]
[null,null,null,null,null,null,null,null,1,"下記フォルダから前回作成スケジュールを開く。"]
[null,null,null,null,null,null,null,null,null,"R:\\01_基幹業務共通\\営業開発室発信情報\\IMPスケジュール作成"]
[null,null,null,null,null,null,null,null,2,"NTL香港のスケジュール処理"]
[null,null,null,null,null,null,null,null,null,"NTL香港のスケジュールには「数式」が含まているので前準備処理が必要。"]
[null,null,null,null,null,null,null,null,null,"1. 対象スケジュールのシート全体をコピー"]
[null,null,null,null,null,null,null,null,null,"2.「形式を選択して貼り付け(S)」を選び、「値 (V)」を選択して貼り付ける。"]
[null,null,null,null,null,null,null,null,null,"3. 数式が全て値になっていれば前準備処理完了。"]
[null,null,null,null,null,null,null,null,3,"「作業」シートの「1. 作業準備」ボタンとクリック。"]
[null,null,null,null,null,null,null,null,null,"以下のシートの過去データがクリアされる。"]
[null,null,null,null,null,null,null,null,null,"「成形版」「加工(東)」「加工(西)」「加工(九)」「貼付シート(HKG)」"]
[null,null,null,null,null,null,null,null,4,"「2. 保存データ処理」ボタンをクリック。「保存」シートに移動するので「保存」シートの下記セル情報を手入力。"]
[null,null,null,null,null,null,null,null,null,"セルB1","スケジュールの作成月を英語で入力（大文字)"]
[null,null,null,null,null,null,null,null,null,"セルB6","スケジュールの作成年月を入力（yyyymm)"]
[null,null,null,null,null,null,null,null,null,null,"(セルB6の情報は保存フォルダ情報と連携しているので必ず「yyyymm」で入力する。年月の間に「/ (スラッシュ)」は入れない。"]
[null,null,null,null,null,null,null,null,null,"※「保存」シートの上記セル以外のセル情報は変更しないでください。変更すると保存ができなくなります。"]
[null,null,null,null,null,null,null,null,5,"「保存」シート処理完了後、「作業シートに戻る」ボタンをクリック。「作業」シートに戻る。"]
[null,null,null,null,null,null,null,null,6,"「3. 貼付シート処理」ボタンをクリック。「貼付シート(HKG)」に移動。"]
[null,null,null,null,null,null,null,null,7,"NTL香港のスケジュールを「貼付シート(HKG)」シートのC3以降に貼り付ける。"]
[null,null,null,null,null,null,null,null,null,"スケジュール貼付後、「作業シートに戻る」ボタンをクリック。「作業」シートに戻る。"]
[null,null,null,null,null,null,null,null,8,"「4. データ加工」ボタンをクリック。NTL香港スケジュールをHP掲載用データに加工するマクロが起動する。"]
[null,null,null,null,null,null,null,null,null,"データ加工が完了したら「データ加工が完了しました」とメッセージボックスが表示されるので「OK」クリックで作業完了。"]
[null,null,null,null,null,null,null,null,9,"「all port」シートに正しくデータが表示されているか確認。"]
[null,null,null,null,null,null,null,null,null,"データが正しく表示されていない場合や、エラーが表示されている場合は、「成形版」シートのデータを修正する。"]
[null,null,null,null,null,null,null,null,null,"※どうしてもエラーが解消されない場合は、御社本社・森下部長に連絡をして対応を確認する。"]
[null,null,null,null,null,null,null,null,10,"全てのデータが「all port」に正しく表示されているのを確認後、「all port」シート右上の会社ロゴをクリック。保存マクロが起動。"]
[null,null,null,null,null,null,null,null,11,"保存されるPDFが表示されるので正しく表示されているか確認。表示内容に問題がなければPDFは閉じる。"]
[null,null,null,null,null,null,null,null,12,"「名前を付けて保存」ウィンドウが表示されるので、保存先フォルダが正しいか確認。問題がなければ保存。"]
[null,null,null,null,null,null,null,null,13,"作業完了。"]